program: Gaussian 09
title: 000006152
version: EM64L-G09RevD.01
frameworkgroup: C1[X(C21H30FNO)]
method: RPBEPBE
basis: SDD
operation: Freq
keyword: #p
keyword: freq=noraman
keyword: PBEPBE/SDD
title: #p freq=noraman PBEPBE/SDD
converged: YES YES NO NO
title: Mulliken charges:
elementType: F O N C C C C C C C C C C C C C C C C C C C C C H H H H H H H H H H H H H H H H H H H H H H H H H H H H H H
charge: -0.198832 -0.226838 -0.079410 0.501547 -0.538604 -0.490237 -0.504009 -0.512539 -0.020124 -0.429302 -0.414266 -0.405557 -0.403809 -0.750083 -0.335731 -0.443215 -0.502543 0.117667 0.294152 -0.310284 -0.321347 -0.387647 -0.372312 0.331472 0.202770 0.190768 0.191883 0.200836 0.193517 0.204299 0.205671 0.199621 0.204959 0.193492 0.208260 0.201410 0.181435 0.188860 0.206532 0.218150 0.185570 0.214642 0.212895 0.207229 0.193086 0.191030 0.234278 0.217686 0.222822 0.272173 0.255406 0.283832 0.258167 0.260572
chargesum: 0.00000
title: Mulliken charges with hydrogens summed into heavy atoms:
elementType: F O N C C C C C C C C C C C C C C C C C C C C C
charge: -0.198832 -0.226838 -0.079410 0.501547 -0.145067 -0.097518 -0.106193 -0.107247 0.184835 -0.027551 -0.031420 -0.010164 -0.000089 -0.115317 0.048385 0.008749 -0.007548 0.117667 0.294152 -0.054877 -0.037515 -0.129481 -0.111740 0.331472
polarizability: 2.95845363e+02 -2.58313147e+01 2.15610271e+02 7.85394153e+00 1.69565890e+01 1.97585356e+02
1716.lowfreq: -13.8458 -1.7258 -0.0004 0.0004 0.0007 7.4571 9.3025 18.3600 22.5483
frequency: 4.7367 18.3007 22.1410 41.4364 49.5864 86.7959 100.7145 108.7816 121.6937 131.0660 184.0070 201.5421 214.2238 226.4368 233.2614 248.8642 273.6976 276.4937 286.4664 299.3488 316.5906 333.2986 361.6270 374.1076 388.6856 410.7223 412.1319 423.7625 446.1217 456.4165 464.6216 479.0551 488.5977 504.0236 539.9771 568.4001 582.1253 592.8104 625.6525 708.0367 716.4519 728.7762 755.7850 784.7917 796.7854 804.4718 811.8857 821.4217 839.1004 848.2385 856.0307 878.4405 887.4727 893.7080 929.4215 943.9342 958.1782 959.2609 970.4454 975.9700 988.9678 996.3576 1006.2302 1008.0098 1018.4279 1022.1095 1049.8613 1057.0874 1075.9215 1087.0240 1094.3383 1095.9896 1103.6921 1115.6365 1121.9427 1124.0696 1141.8817 1154.8977 1156.7972 1184.9682 1189.8193 1190.8922 1199.4410 1202.8712 1217.4713 1234.2076 1253.5868 1268.1166 1270.4731 1277.2715 1282.9783 1288.5350 1290.9163 1302.8060 1311.9625 1320.5122 1324.8991 1332.1461 1334.2657 1338.9899 1345.3086 1352.4513 1357.2397 1358.3013 1367.6678 1381.0466 1384.9772 1389.6841 1409.2170 1436.1795 1448.5154 1456.2639 1458.3147 1462.9105 1464.3870 1469.7857 1473.1844 1474.3190 1476.7752 1477.4092 1481.2175 1485.8355 1490.4606 1570.6248 1600.9654 1612.4349 2828.5738 2841.7632 2860.0890 2941.2988 2947.1152 2947.9752 2950.0640 2958.4883 2963.8266 2965.2103 2973.2799 2978.9427 2999.3742 3000.4567 3009.2151 3010.2289 3012.8802 3015.4029 3020.8423 3025.5142 3033.4001 3036.4093 3041.6951 3058.1771 3063.3432 3067.2992 3155.0961 3156.4858 3176.8202 3179.9494
redmass: 5.7000 4.9772 3.8206 4.6084 4.7558 4.3918 4.4964 3.9411 2.8089 2.7435 2.8132 2.1856 1.1817 4.7920 2.3167 2.5442 3.2572 2.3119 5.5476 2.9036 1.9585 2.7450 2.1473 6.3874 2.6398 2.9408 2.4692 1.8379 2.1337 3.2324 4.5715 3.1723 3.0620 3.3044 2.2485 2.2072 6.4918 2.0719 7.1851 2.8963 2.2865 2.8361 5.3418 2.0442 1.7247 1.5890 5.0093 1.3143 1.6653 1.5342 1.5040 2.0637 2.3219 2.2536 1.8490 1.9364 1.5572 1.8370 1.8058 1.4978 1.3555 3.6350 2.1283 1.9900 1.5730 2.0819 2.1178 2.2853 1.9350 1.6584 1.7078 1.6726 1.3485 2.3540 2.3529 2.1632 1.9772 1.4076 1.6203 1.1480 2.0654 1.8422 1.9701 2.0707 1.5504 1.5920 1.5661 1.2009 1.3680 1.3950 1.3359 1.3893 1.2917 1.3818 1.5449 1.4975 1.4278 1.4182 1.3650 1.5812 1.4278 1.4905 1.6047 1.6085 1.4271 5.9449 1.2198 1.4252 4.0513 1.1017 1.0875 1.0841 1.0881 1.0860 1.0881 1.0835 1.0734 1.0601 1.0665 1.0788 1.0867 1.0920 2.6073 8.0247 7.2636 7.2285 1.0722 1.0708 1.0699 1.0733 1.0616 1.0644 1.0620 1.0656 1.0426 1.0545 1.0641 1.0625 1.0929 1.0862 1.0982 1.0678 1.0894 1.0924 1.0968 1.1013 1.1028 1.0871 1.0986 1.0989 1.0993 1.0996 1.0884 1.0889 1.0964 1.0974
irintensity: 0.0705 0.8471 0.1326 0.1710 0.3088 2.2605 2.6193 0.1029 0.1521 0.7212 5.2187 0.5246 0.0490 11.8985 0.1668 0.9197 0.8134 1.4828 1.0893 3.0512 0.6148 0.0160 3.5593 3.7724 1.1806 0.0773 0.1943 0.1823 0.5323 0.1795 3.9770 5.8562 1.6689 9.2808 0.6110 10.6638 28.8742 7.1658 0.3729 3.4978 7.1353 9.9948 1.7614 3.6766 26.8069 6.7596 19.5383 2.7080 6.7622 54.6308 1.2902 21.2141 8.5863 0.5090 4.3419 17.1174 11.8463 3.1937 10.7711 1.0350 0.1565 29.5697 4.4950 6.3349 2.4565 5.7187 3.4198 1.5157 3.8385 2.6855 1.0019 0.7721 9.2761 34.2906 36.4848 9.6600 3.3671 86.6101 2.9206 4.2499 7.9467 4.0790 1.6951 32.5281 17.4069 109.1092 19.7833 6.4278 38.6426 1.8687 57.5788 24.4461 3.2208 8.8410 76.5571 8.0473 1.4573 1.9793 6.5020 0.6686 0.1872 3.6425 60.3842 8.3131 0.6739 18.7460 9.9835 2.1457 16.0111 17.0335 4.9550 1.1666 3.3615 5.1369 15.5804 1.5216 6.9248 40.4825 3.6081 12.0366 5.4611 13.1672 28.7641 103.0781 72.7220 63.7240 56.2906 68.7572 224.3685 5.6572 88.4541 16.1480 28.6360 42.9076 65.9908 60.9893 13.1776 30.0327 16.5261 8.7148 29.3556 30.1498 92.3347 42.1827 27.1318 48.3396 95.8154 38.5085 53.7771 70.0976 46.5513 40.7562 6.2499 0.0426 4.6584 4.5755
temp: 298.150 k
press: 1.00000 atm
elementType: 9 8 7 6 6 6 6 6 6 6 6 6 6 6 6 6 6 6 6 6 6 6 6 6 1 1 1 1 1 1 1 1 1 1 1 1 1 1 1 1 1 1 1 1 1 1 1 1 1 1 1 1 1 1
symmnumber: 1
zpe: 1224425.7 jmol-1
zpe.correction: 0.466359 hartree
zpe.thermalcorrener: 0.489552 hartree
zpe.thermalcorrenthalpy: 0.490496 hartree
zpe.thermalcorrgfe: 0.410657 hartree
zpe.sumelectzpe: -1046.208847 hartree
zpe.sumelectthermal: -1046.185654 hartree
zpe.sumelectthermalent: -1046.184710 hartree
zpe.sumelectthermalfe: -1046.264549 hartree
dipole: 2.4439 0.3379 2.1302
dipole: 3.2595
quadrupole: -155.8571 -151.0744 -143.6043
quadrupole: 1.4335 -2.4176 -4.0106
quadrupole: -5.6785 -0.8958 6.5743 1.4335 -2.4176 -4.0106
hfenergy: -1046.675206 hartree
pointgroup: C01 [X(C21H30F1N1O1)]
dipole: -0.9951546 0.1173232 0.8002845 debye
polarizability: 295.4029889|-26.6950182|205.1769326|3.3763217|-20.2560029|208.4610692 unknown
InChI: InChI=1S/C21H30FNO/c1-17-4-2-10-21(16-17)11-14-23(15-12-21)13-3-5-20(24)18-6-8-19(22)9-7-18/h6-9,17H,2-5,10-16H2,1H3
charge 0 multiplicity 1
54 atoms
F  7.194129 -2.27439 1.316503
O  3.184895 1.451099 -2.029376
N  -1.09712 1.354986 0.353175
C  -3.429578 -0.546354 0.466686
C  -4.727515 0.270712 0.178477
C  -3.832545 -2.022686 0.758383
C  -2.700182 0.021007 1.720747
C  -2.416692 -0.482298 -0.717433
C  -5.634132 -0.331944 -0.927119
C  -4.716435 -2.651801 -0.343207
C  -5.984292 -1.803034 -0.590339
C  -2.055087 1.400555 1.487545
C  -1.769514 0.906531 -0.893183
C  -6.905435 0.521496 -1.125179
C  -0.364499 2.635784 0.180505
C  0.942356 2.476908 -0.627817
C  1.894916 1.471304 0.041048
C  3.084861 1.070098 -0.823901
C  4.148977 0.188652 -0.222619
C  4.057135 -0.330478 1.097769
C  5.283008 -0.139299 -1.016173
C  5.072053 -1.158132 1.620944
C  6.308179 -0.961082 -0.512062
C  6.175666 -1.451579 0.800671
H  -4.479206 1.316788 -0.087293
H  -5.319054 0.322741 1.118916
H  -4.391434 -2.049582 1.718696
H  -2.916439 -2.629824 0.907206
H  -3.412884 0.089664 2.567649
H  -1.900452 -0.687725 2.017723
H  -1.609194 -1.217379 -0.525835
H  -2.897733 -0.772479 -1.670354
H  -5.069978 -0.329312 -1.884765
H  -4.999099 -3.682109 -0.051011
H  -4.140976 -2.740662 -1.286764
H  -6.590338 -2.243505 -1.406926
H  -6.618205 -1.817026 0.322508
H  -2.850555 2.172141 1.31817
H  -1.500453 1.706807 2.39515
H  -1.018954 0.855323 -1.702266
H  -2.541152 1.653941 -1.217174
H  -7.547326 0.105603 -1.924598
H  -6.653427 1.563371 -1.399397
H  -7.505669 0.554235 -0.194872
H  -1.007344 3.412031 -0.307707
H  -0.118759 3.015884 1.192267
H  0.734347 2.150235 -1.662336
H  1.430643 3.465787 -0.719711
H  2.265244 1.873809 1.006473
H  1.304547 0.566007 0.303467
H  3.190666 -0.098547 1.724267
H  5.332779 0.266257 -2.031756
H  5.018759 -1.56915 2.632984
H  7.187898 -1.221377 -1.107457
