program: Orca
programVersion: 5.0.4
elementType: S S S P O O C C C C C C C C H H H H H H H H H H H H H H H H H H H
charge: 0
multiplicity: 1
keywords: wb97x-d3
keywords: def2-TZVPP
keywords: def2/J RIJCOSX
keywords: DEFGRID2
keywords: scfconv7
keywords: smallprint printgap noloewdin
keywords: NOSOSCF
formula: C8H19O2PS3
InChI: InChI=1/C8H19O2PS3/c1-4-9-11(12,10-5-2)14-8-7-13-6-3/h4-8H2,1-3H3
33 atoms
S  -0.425393 -1.198531 -0.658864
S  -2.913708 1.159554 -0.618492
S  1.276839 -0.19529 2.135539
P  1.308828 -0.442812 0.22258
O  2.374385 -1.481157 -0.361475
O  1.686571 0.865607 -0.632165
C  -1.662765 -1.020301 0.663676
C  -2.215733 0.376726 0.85327
C  3.699233 -1.616626 0.203701
C  0.943145 2.087324 -0.474714
C  -4.187316 -0.031914 -1.11582
C  4.574098 -0.410031 -0.02923
C  1.643135 3.172821 -1.249735
C  -5.277235 -0.244576 -0.084075
H  -1.229475 -1.377375 1.598207
H  -2.448938 -1.724806 0.388872
H  -1.432669 1.052719 1.201213
H  -2.9629 0.334943 1.648818
H  3.610784 -1.837588 1.26902
H  4.111903 -2.495153 -0.288158
H  -0.073891 1.936445 -0.847828
H  0.883084 2.34579 0.585002
H  -4.606813 0.384379 -2.033206
H  -3.71977 -0.977864 -1.394543
H  4.624197 -0.14682 -1.085476
H  4.240909 0.460007 0.53599
H  5.585228 -0.647164 0.302952
H  2.653451 3.341843 -0.877292
H  1.694711 2.939561 -2.313096
H  1.085796 4.102867 -1.13868
H  -4.886409 -0.673713 0.838956
H  -5.776135 0.692056 0.16358
H  -6.027958 -0.935847 -0.470575
elementType: S P O C H
totalener: -2002.87141520 hartree
nucrepener: 1544.97886821 hartree
electener: -3547.85028341 hartree
oneelecener: -5833.58750337 hartree
twoeener: 2285.73721996 hartree
cpcmener: -0.02039824 hartree
kineticenergy: 1997.86232265 hartree
xcener: -120.685447452117 hartree
chargesum: 0.0000000
charge: -0.166194 -0.169294 -0.460598 0.648312 -0.365509 -0.341561 -0.118898 -0.162955 0.024838 0.052175 -0.097609 -0.234946 -0.254578 -0.259331 0.134711 0.138836 0.114699 0.129265 0.094413 0.109800 0.080984 0.100139 0.113727 0.089322 0.089937 0.075974 0.099754 0.091139 0.089538 0.089711 0.086273 0.081308 0.096619
qa: -0.1662 -0.1693 -0.4606 0.6483 -0.3655 -0.3416 -0.1189 -0.1630 0.0248 0.0522 -0.0976 -0.2349 -0.2546 -0.2593 0.1347 0.1388 0.1147 0.1293 0.0944 0.1098 0.0810 0.1001 0.1137 0.0893 0.0899 0.0760 0.0998 0.0911 0.0895 0.0897 0.0863 0.0813 0.0966
va: 2.2966 2.1834 1.9895 5.3996 2.1108 2.0755 3.8541 3.9788 3.8730 3.8077 3.9443 3.8841 3.9778 3.9244 1.0302 0.9962 1.0106 1.0051 1.0081 0.9899 1.0174 1.0039 1.0005 1.0083 1.0075 1.0201 1.0088 1.0047 1.0038 1.0058 0.9993 1.0130 1.0046
dispcorr: -0.015627021 hartree
energy: -2002.887042220184
dipole: -5.73405 5.14940 -0.58465 6.53106 -6.67200 -0.14094 -2.14504 2.04590 -0.09914
magnitude: 0.60952 au
magnitude: 1.54927 debye
