program: Orca
programVersion: 5.0.4
elementType: S S S P O O C C C C C C C C H H H H H H H H H H H H H H H H H H H
charge: 0
multiplicity: 1
keywords: wb97x-d3
keywords: def2-TZVPP
keywords: def2/J RIJCOSX
keywords: DEFGRID2
keywords: scfconv7
keywords: smallprint printgap noloewdin
keywords: NOSOSCF
formula: C8H19O2PS3
InChI: InChI=1/C8H19O2PS3/c1-4-9-11(12,10-5-2)14-8-7-13-6-3/h4-8H2,1-3H3
33 atoms
S  -0.078508 -1.338221 -0.71248
S  -3.849501 0.691865 0.486323
S  1.036819 1.073129 1.481571
P  1.318839 0.093527 -0.158377
O  2.663121 -0.773748 -0.23568
O  1.416458 0.981927 -1.484347
C  -1.626455 -0.351691 -0.756834
C  -2.306223 -0.256957 0.593914
C  3.193403 -1.516339 0.881002
C  1.947643 2.324949 -1.471643
C  -5.005058 -0.584908 -0.099485
C  4.696114 -1.407372 0.864622
C  3.438376 2.359625 -1.239935
C  -5.434842 -1.552397 0.985549
H  -2.254529 -0.870626 -1.480966
H  -1.4064 0.632585 -1.167322
H  -1.668559 0.266344 1.305701
H  -2.509765 -1.246017 1.005761
H  2.788379 -1.124456 1.815583
H  2.870331 -2.553204 0.780685
H  1.696433 2.726886 -2.451161
H  1.418281 2.913159 -0.720202
H  -5.865844 -0.038699 -0.487908
H  -4.560439 -1.108478 -0.947092
H  5.119242 -1.797908 -0.060921
H  5.020298 -0.374009 0.990017
H  5.104526 -1.990313 1.690077
H  3.704939 2.03105 -0.235063
H  3.972462 1.744261 -1.963652
H  3.787021 3.386444 -1.351941
H  -5.933054 -1.030751 1.802353
H  -6.132454 -2.288509 0.582029
H  -4.587824 -2.099148 1.40087
elementType: S P O C H
totalener: -2002.87217248 hartree
nucrepener: 1497.66095745 hartree
electener: -3500.53312993 hartree
oneelecener: -5738.89140310 hartree
twoeener: 2238.35827318 hartree
cpcmener: -0.02036942 hartree
kineticenergy: 1997.85390436 hartree
xcener: -120.678977354737 hartree
chargesum: 0.0000000
charge: -0.173472 -0.186308 -0.466669 0.652551 -0.360962 -0.356145 -0.095062 -0.147795 0.045431 0.042529 -0.093371 -0.239561 -0.237886 -0.254934 0.137509 0.112447 0.120287 0.112954 0.087546 0.104448 0.111526 0.092786 0.105719 0.095835 0.090707 0.085798 0.092887 0.071291 0.092433 0.099840 0.078679 0.092952 0.086005
qa: -0.1735 -0.1863 -0.4667 0.6526 -0.3610 -0.3561 -0.0951 -0.1478 0.0454 0.0425 -0.0934 -0.2396 -0.2379 -0.2549 0.1375 0.1124 0.1203 0.1130 0.0875 0.1044 0.1115 0.0928 0.1057 0.0958 0.0907 0.0858 0.0929 0.0713 0.0924 0.0998 0.0787 0.0930 0.0860
va: 2.2913 2.1566 1.9701 5.4240 2.0855 2.0857 3.8630 3.9513 3.8345 3.8363 3.9414 3.9446 3.9063 3.9224 1.0046 1.0338 1.0309 1.0119 1.0123 0.9933 0.9918 1.0151 1.0020 1.0080 1.0037 1.0051 1.0081 1.0177 1.0060 1.0096 1.0123 1.0051 1.0021
dispcorr: -0.014213235 hartree
energy: -2002.886385716398
dipole: -0.55643 0.80913 0.25270 -3.06169 2.21411 -0.84758 0.22199 -1.00601 -0.78401
magnitude: 1.18191 au
magnitude: 3.00419 debye
