program: Orca
programVersion: 5.0.4
elementType: S S S P O O C C C C C C C C H H H H H H H H H H H H H H H H H H H
charge: 0
multiplicity: 1
keywords: wb97x-d3
keywords: def2-TZVPP
keywords: def2/J RIJCOSX
keywords: DEFGRID2
keywords: scfconv7
keywords: smallprint printgap noloewdin
keywords: NOSOSCF
formula: C8H19O2PS3
InChI: InChI=1/C8H19O2PS3/c1-4-9-11(12,10-5-2)14-8-7-13-6-3/h4-8H2,1-3H3
33 atoms
S  0.542702 -1.141338 -1.008345
S  -3.80481 -0.578622 -0.397266
S  0.128424 1.155498 1.502497
P  1.345313 0.310281 0.274456
O  2.570863 -0.37606 1.0277
O  2.116976 1.278063 -0.746561
C  -1.15947 -1.351438 -0.370029
C  -2.114917 -0.36999 -1.017025
C  3.577709 -1.158242 0.341422
C  1.382789 2.123614 -1.653014
C  -3.705657 0.362262 1.157414
C  3.537765 -2.583105 0.828935
C  2.348813 3.092138 -2.284381
C  -4.969718 0.147117 1.968191
H  -1.1423 -1.260998 0.714898
H  -1.426953 -2.378584 -0.61678
H  -2.149648 -0.530781 -2.094786
H  -1.794842 0.659143 -0.848954
H  3.443131 -1.1144 -0.741762
H  4.534946 -0.688279 0.565714
H  0.898054 1.502657 -2.409306
H  0.603526 2.656711 -1.103533
H  -2.831238 0.037193 1.723309
H  -3.572638 1.419892 0.922598
H  2.591859 -3.06423 0.579358
H  4.338769 -3.146345 0.349436
H  3.687511 -2.641393 1.907184
H  3.130835 2.575005 -2.84044
H  1.80668 3.727644 -2.984435
H  2.814346 3.736439 -1.538845
H  -5.087041 -0.898565 2.25504
H  -4.928553 0.740607 2.88197
H  -5.861799 0.449441 1.417173
elementType: S P O C H
totalener: -2002.87228229 hartree
nucrepener: 1516.32475762 hartree
electener: -3519.19703991 hartree
oneelecener: -5775.83300570 hartree
twoeener: 2256.63596578 hartree
cpcmener: -0.01998377 hartree
kineticenergy: 1997.84733153 hartree
xcener: -120.677522314064 hartree
chargesum: -0.0000000
charge: -0.199895 -0.183039 -0.446355 0.644590 -0.358379 -0.340391 -0.077517 -0.116886 0.029396 0.047502 -0.103884 -0.225087 -0.248130 -0.255698 0.113012 0.129886 0.127046 0.098542 0.088526 0.109658 0.097432 0.094068 0.085692 0.095609 0.074386 0.093049 0.091371 0.088788 0.088432 0.088708 0.086686 0.094719 0.088162
qa: -0.1999 -0.1830 -0.4464 0.6446 -0.3584 -0.3404 -0.0775 -0.1169 0.0294 0.0475 -0.1039 -0.2251 -0.2481 -0.2557 0.1130 0.1299 0.1270 0.0985 0.0885 0.1097 0.0974 0.0941 0.0857 0.0956 0.0744 0.0930 0.0914 0.0888 0.0884 0.0887 0.0867 0.0947 0.0882
va: 2.2730 2.1870 2.0071 5.4335 2.1061 2.0747 3.8246 3.9532 3.8792 3.8259 3.9834 3.9265 3.9771 3.9343 1.0381 1.0182 1.0125 1.0286 0.9953 0.9956 0.9988 1.0010 1.0044 1.0023 1.0157 1.0079 1.0038 1.0035 1.0055 1.0051 1.0085 1.0022 1.0058
dispcorr: -0.014476903 hartree
energy: -2002.886759195876
dipole: -2.05233 2.99749 0.94516 0.75367 -1.08924 -0.33557 -2.10621 0.78801 -1.31820
magnitude: 1.65637 au
magnitude: 4.21017 debye
