program: Orca
programVersion: 5.0.4
elementType: S S S P O O C C C C C C C C H H H H H H H H H H H H H H H H H H H
charge: 0
multiplicity: 1
keywords: wb97x-d3
keywords: def2-TZVPP
keywords: def2/J RIJCOSX
keywords: DEFGRID2
keywords: scfconv7
keywords: smallprint printgap noloewdin
keywords: NOSOSCF
formula: C8H19O2PS3
InChI: InChI=1/C8H19O2PS3/c1-4-9-11(12,10-5-2)14-8-7-13-6-3/h4-8H2,1-3H3
33 atoms
S  -0.090581 -0.0731 -1.430939
S  -3.363937 -0.581298 1.528775
S  0.760139 2.18064 0.963825
P  1.333803 0.684911 -0.101687
O  1.845076 -0.523543 0.805765
O  2.580615 0.881062 -1.087453
C  -1.639976 0.162607 -0.491216
C  -1.759212 -0.762423 0.703048
C  2.326781 -1.765859 0.241215
C  2.597116 1.912408 -2.098667
C  -4.444217 -1.545306 0.429144
C  1.800334 -2.912404 1.062973
C  3.395096 3.105268 -1.64037
C  -4.266081 -3.044441 0.558961
H  -2.421629 -0.033524 -1.22615
H  -1.709009 1.209149 -0.197175
H  -1.010795 -0.516933 1.457417
H  -1.601117 -1.803032 0.416567
H  2.004664 -1.871165 -0.796954
H  3.416227 -1.733104 0.252066
H  3.044671 1.452975 -2.978084
H  1.578487 2.202703 -2.364396
H  -5.459456 -1.255487 0.704069
H  -4.296828 -1.215952 -0.600589
H  2.110227 -2.839377 2.105285
H  0.711767 -2.962876 1.022427
H  2.194476 -3.846408 0.662159
H  3.445405 3.83104 -2.452334
H  2.931518 3.590774 -0.783292
H  4.414729 2.827346 -1.37756
H  -4.469557 -3.379481 1.575568
H  -4.954113 -3.563479 -0.110846
H  -3.255978 -3.358489 0.295058
elementType: S P O C H
totalener: -2002.87434898 hartree
nucrepener: 1517.50779697 hartree
electener: -3520.38214595 hartree
oneelecener: -5778.24807717 hartree
twoeener: 2257.86593122 hartree
cpcmener: -0.02332508 hartree
kineticenergy: 1997.85663279 hartree
xcener: -120.680464862122 hartree
chargesum: 0.0000000
charge: -0.191108 -0.180212 -0.446677 0.641522 -0.349584 -0.353726 -0.092068 -0.140532 0.023344 0.045686 -0.095231 -0.229901 -0.240752 -0.256282 0.137290 0.113180 0.114985 0.111953 0.097659 0.109534 0.110346 0.084686 0.106230 0.095115 0.091727 0.080341 0.094025 0.094992 0.073549 0.089965 0.079911 0.093924 0.086108
qa: -0.1911 -0.1802 -0.4467 0.6415 -0.3496 -0.3537 -0.0921 -0.1405 0.0233 0.0457 -0.0952 -0.2299 -0.2408 -0.2563 0.1373 0.1132 0.1150 0.1120 0.0977 0.1095 0.1103 0.0847 0.1062 0.0951 0.0917 0.0803 0.0940 0.0950 0.0735 0.0900 0.0799 0.0939 0.0861
va: 2.2774 2.1675 2.0143 5.4330 2.0801 2.0794 3.8382 3.9554 3.8598 3.8427 3.9430 3.9351 3.9383 3.9201 1.0051 1.0423 1.0275 1.0087 1.0004 0.9977 0.9928 1.0101 1.0012 1.0077 1.0051 1.0057 1.0087 1.0080 1.0207 1.0039 1.0122 1.0049 1.0015
dispcorr: -0.014916462 hartree
energy: -2002.889265444085
dipole: -4.07556 4.14227 0.06671 -13.35677 11.55486 -1.80191 -4.50660 2.28570 -2.22090
magnitude: 2.86072 au
magnitude: 7.27137 debye
