program: Orca
programVersion: 5.0.4
elementType: S S S P O O C C C C C C C C H H H H H H H H H H H H H H H H H H H
charge: 0
multiplicity: 1
keywords: wb97x-d3
keywords: def2-TZVPP
keywords: def2/J RIJCOSX
keywords: DEFGRID2
keywords: scfconv7
keywords: smallprint printgap noloewdin
keywords: NOSOSCF
formula: C8H19O2PS3
InChI: InChI=1/C8H19O2PS3/c1-4-9-11(12,10-5-2)14-8-7-13-6-3/h4-8H2,1-3H3
33 atoms
S  0.12822 -1.782781 -1.015551
S  -2.704076 0.34817 -0.798871
S  0.43918 0.218859 1.75006
P  0.967369 -0.130176 -0.074425
O  2.529402 -0.453693 -0.288163
O  0.795168 1.049402 -1.135563
C  -1.451366 -2.078866 -0.163286
C  -2.649322 -1.455862 -0.851558
C  3.223872 -1.358433 0.592127
C  1.336399 2.363343 -0.859299
C  -3.222235 0.605671 0.922264
C  4.129417 -0.594337 1.524763
C  0.259367 3.306186 -0.387078
C  -3.358999 2.090462 1.197835
H  -1.35381 -1.763346 0.876136
H  -1.558314 -3.165074 -0.161186
H  -3.559752 -1.85237 -0.395468
H  -2.67492 -1.743004 -1.903289
H  2.514937 -1.970459 1.154655
H  3.794692 -2.028143 -0.050572
H  2.147461 2.303783 -0.130158
H  1.769741 2.701266 -1.799811
H  -4.173041 0.095183 1.084651
H  -2.479619 0.167587 1.589699
H  4.692053 -1.297749 2.139171
H  4.846003 0.014708 0.973469
H  3.558726 0.053463 2.189844
H  -0.553775 3.380219 -1.108983
H  -0.151048 2.99434 0.572218
H  0.689503 4.300516 -0.263784
H  -4.095674 2.556788 0.543283
H  -3.682206 2.248617 2.226969
H  -2.409791 2.610312 1.064872
elementType: S P O C H
totalener: -2002.87032398 hartree
nucrepener: 1587.77875763 hartree
electener: -3590.64908161 hartree
oneelecener: -5919.94916975 hartree
twoeener: 2329.30008815 hartree
cpcmener: -0.01971698 hartree
kineticenergy: 1997.87172824 hartree
xcener: -120.687356446103 hartree
chargesum: 0.0000000
charge: -0.165817 -0.165184 -0.462903 0.677799 -0.378624 -0.350776 -0.104903 -0.112892 0.050745 0.050556 -0.131858 -0.243022 -0.254136 -0.261716 0.115310 0.134308 0.110356 0.111126 0.078721 0.108216 0.088622 0.107509 0.106131 0.095711 0.095474 0.089465 0.074511 0.087344 0.072198 0.103403 0.091374 0.097830 0.085124
qa: -0.1658 -0.1652 -0.4629 0.6778 -0.3786 -0.3508 -0.1049 -0.1129 0.0507 0.0506 -0.1319 -0.2430 -0.2541 -0.2617 0.1153 0.1343 0.1104 0.1111 0.0787 0.1082 0.0886 0.1075 0.1061 0.0957 0.0955 0.0895 0.0745 0.0873 0.0722 0.1034 0.0914 0.0978 0.0851
va: 2.3065 2.1991 1.9727 5.4022 2.0655 2.0774 3.8450 3.9749 3.8498 3.8690 3.9834 3.9379 3.9249 3.9222 1.0327 1.0065 1.0119 1.0120 1.0160 0.9950 1.0033 0.9950 1.0045 1.0057 1.0085 1.0035 1.0194 1.0036 1.0146 1.0123 1.0090 1.0027 1.0035
dispcorr: -0.016516154 hartree
energy: -2002.886840130540
dipole: -2.72151 2.76093 0.03942 8.51041 -9.17423 -0.66382 7.79408 -7.34978 0.44430
magnitude: 0.79976 au
magnitude: 2.03283 debye
