program: Orca
programVersion: 5.0.4
elementType: S S S P O O C C C C C C C C H H H H H H H H H H H H H H H H H H H
charge: 0
multiplicity: 1
keywords: wb97x-d3
keywords: def2-TZVPP
keywords: def2/J RIJCOSX
keywords: DEFGRID2
keywords: scfconv7
keywords: smallprint printgap noloewdin
keywords: NOSOSCF
formula: C8H19O2PS3
InChI: InChI=1/C8H19O2PS3/c1-4-9-11(12,10-5-2)14-8-7-13-6-3/h4-8H2,1-3H3
33 atoms
S  0.299719 -1.798822 -0.854288
S  -3.928909 -0.549982 -0.331286
S  0.414951 0.488399 1.674567
P  1.087219 -0.048185 -0.052673
O  2.659801 -0.341154 -0.148319
O  0.909913 1.014779 -1.234324
C  -1.429444 -1.709857 -0.264856
C  -2.259431 -0.693186 -1.023955
C  3.336373 -1.177592 0.811143
C  0.897031 2.437769 -0.987715
C  -3.604296 0.532221 1.094919
C  4.79325 -0.795614 0.830161
C  2.253551 2.976905 -0.605748
C  -3.334347 1.974858 0.717699
H  -1.405134 -1.509895 0.805995
H  -1.822872 -2.716347 -0.407353
H  -2.372966 -0.995456 -2.065404
H  -1.792125 0.291724 -1.028552
H  2.889544 -1.043361 1.79857
H  3.205409 -2.220987 0.518751
H  0.553672 2.874299 -1.923555
H  0.153702 2.662675 -0.220243
H  -4.496541 0.459243 1.718247
H  -2.779722 0.120016 1.678476
H  5.258031 -0.928993 -0.146747
H  4.928407 0.239335 1.144555
H  5.319429 -1.433229 1.540161
H  2.583846 2.608524 0.365778
H  3.008917 2.728582 -1.350931
H  2.19333 4.063632 -0.540345
H  -2.465401 2.071721 0.065791
H  -4.189789 2.417891 0.208831
H  -3.13176 2.564507 1.613672
elementType: S P O C H
totalener: -2002.87450823 hartree
nucrepener: 1548.00195932 hartree
electener: -3550.87646755 hartree
oneelecener: -5839.27206744 hartree
twoeener: 2288.39559989 hartree
cpcmener: -0.01785640 hartree
kineticenergy: 1997.86086414 hartree
xcener: -120.682057099727 hartree
chargesum: -0.0000000
charge: -0.172942 -0.186800 -0.460192 0.656059 -0.361659 -0.359756 -0.105719 -0.118370 0.045353 0.050288 -0.096865 -0.244208 -0.243430 -0.258633 0.118773 0.134117 0.128316 0.091115 0.089822 0.098973 0.113556 0.087701 0.113158 0.088550 0.089779 0.087205 0.090609 0.074411 0.092938 0.099192 0.073783 0.088529 0.096349
qa: -0.1729 -0.1868 -0.4602 0.6561 -0.3617 -0.3598 -0.1057 -0.1184 0.0454 0.0503 -0.0969 -0.2442 -0.2434 -0.2586 0.1188 0.1341 0.1283 0.0911 0.0898 0.0990 0.1136 0.0877 0.1132 0.0885 0.0898 0.0872 0.0906 0.0744 0.0929 0.0992 0.0738 0.0885 0.0963
va: 2.3062 2.1620 1.9811 5.4039 2.0932 2.0730 3.8482 3.9468 3.8402 3.8291 3.9186 3.9592 3.9212 3.9214 1.0352 1.0119 1.0130 1.0288 1.0070 0.9955 0.9906 1.0088 1.0035 1.0190 1.0034 1.0053 1.0066 1.0190 1.0062 1.0087 0.9996 1.0163 1.0032
dispcorr: -0.016170303 hartree
energy: -2002.890678537582
dipole: 4.38626 -3.49510 0.89116 11.32168 -10.87624 0.44545 3.39504 -3.35348 0.04155
magnitude: 0.99716 au
magnitude: 2.53457 debye
