program: Orca
programVersion: 5.0.4
elementType: S S S P O O C C C C C C C C H H H H H H H H H H H H H H H H H H H
charge: 0
multiplicity: 1
keywords: wb97x-d3
keywords: def2-TZVPP
keywords: def2/J RIJCOSX
keywords: DEFGRID2
keywords: scfconv7
keywords: smallprint printgap noloewdin
keywords: NOSOSCF
formula: C8H19O2PS3
InChI: InChI=1/C8H19O2PS3/c1-4-9-11(12,10-5-2)14-8-7-13-6-3/h4-8H2,1-3H3
33 atoms
S  -0.041761 -0.421395 -1.999968
S  -3.401915 -1.714184 0.602058
S  0.167996 1.786057 0.582647
P  1.078111 0.461809 -0.487464
O  1.671415 -0.797983 0.298614
O  2.36428 0.948697 -1.309374
C  -1.687811 -0.527686 -1.210839
C  -1.772116 -1.639041 -0.184824
C  2.402234 -0.647552 1.537237
C  2.342483 2.192069 -2.046714
C  -3.304573 -0.250035 1.678716
C  2.335033 -1.953985 2.283639
C  3.103266 3.262889 -1.307218
C  -4.413185 -0.295604 2.71221
H  -2.378964 -0.70601 -2.034647
H  -1.918267 0.44853 -0.78515
H  -1.017391 -1.524455 0.594908
H  -1.605904 -2.607354 -0.658195
H  3.433066 -0.377437 1.302288
H  1.963464 0.159592 2.126971
H  2.801056 1.974615 -3.010316
H  1.313807 2.50736 -2.236246
H  -2.327331 -0.246338 2.164514
H  -3.381156 0.657975 1.080078
H  2.912604 -1.867901 3.203953
H  1.30914 -2.205799 2.553123
H  2.756064 -2.773623 1.70136
H  2.61293 3.527648 -0.371063
H  4.124826 2.94945 -1.091898
H  3.153664 4.15837 -1.927512
H  -5.39936 -0.321479 2.247433
H  -4.319631 -1.167337 3.35963
H  -4.369566 0.59491 3.339901
elementType: S P O C H
totalener: -2002.87379175 hartree
nucrepener: 1523.87176556 hartree
electener: -3526.74555730 hartree
oneelecener: -5791.09058129 hartree
twoeener: 2264.34502398 hartree
cpcmener: -0.01759358 hartree
kineticenergy: 1997.85657980 hartree
xcener: -120.678694503395 hartree
chargesum: -0.0000000
charge: -0.168601 -0.179901 -0.460916 0.657729 -0.350209 -0.370034 -0.098546 -0.110739 0.030744 0.049391 -0.101444 -0.242287 -0.241009 -0.255288 0.129773 0.118521 0.089629 0.125831 0.114034 0.091866 0.111125 0.083736 0.088170 0.090220 0.091779 0.087906 0.089703 0.075501 0.089672 0.095428 0.088056 0.086155 0.094006
qa: -0.1686 -0.1799 -0.4609 0.6577 -0.3502 -0.3700 -0.0985 -0.1107 0.0307 0.0494 -0.1014 -0.2423 -0.2410 -0.2553 0.1298 0.1185 0.0896 0.1258 0.1140 0.0919 0.1111 0.0837 0.0882 0.0902 0.0918 0.0879 0.0897 0.0755 0.0897 0.0954 0.0881 0.0862 0.0940
va: 2.3067 2.1903 1.9835 5.4152 2.0887 2.0778 3.8410 3.9663 3.8356 3.8415 3.9849 3.9508 3.9430 3.9367 1.0148 1.0358 1.0350 1.0107 0.9938 1.0102 0.9945 1.0127 1.0067 1.0013 1.0071 1.0032 1.0042 1.0185 1.0038 1.0078 1.0040 1.0101 1.0025
dispcorr: -0.014689424 hartree
energy: -2002.888481172329
dipole: 0.06475 0.89392 0.95867 1.94360 -1.53654 0.40706 11.54522 -11.44909 0.09613
magnitude: 1.04594 au
magnitude: 2.65857 debye
