program: Orca
programVersion: 5.0.4
elementType: S S S P O O C C C C C C C C H H H H H H H H H H H H H H H H H H H
charge: 0
multiplicity: 1
keywords: wb97x-d3
keywords: def2-TZVPP
keywords: def2/J RIJCOSX
keywords: DEFGRID2
keywords: scfconv7
keywords: smallprint printgap noloewdin
keywords: NOSOSCF
formula: C8H19O2PS3
InChI: InChI=1/C8H19O2PS3/c1-4-9-11(12,10-5-2)14-8-7-13-6-3/h4-8H2,1-3H3
33 atoms
S  0.144685 -1.644077 -1.10175
S  -3.926138 0.085979 -0.665528
S  0.49814 0.232497 1.735401
P  1.294274 -0.366262 0.082326
O  2.614368 -1.259972 0.177672
O  1.821257 0.801019 -0.885282
C  -1.55803 -1.349824 -0.500503
C  -2.1507 -0.054228 -1.017555
C  3.614748 -1.032121 1.197392
C  1.048084 1.978727 -1.174521
C  -3.949791 1.00261 0.901873
C  4.337826 0.283585 1.050928
C  1.992822 3.105732 -1.497821
C  -3.546477 0.203519 2.123829
H  -1.55881 -1.406321 0.586332
H  -2.11321 -2.208186 -0.88023
H  -2.04251 -0.00079 -2.101548
H  -1.641783 0.814385 -0.596131
H  3.143259 -1.113486 2.178552
H  4.305106 -1.866143 1.086479
H  0.386324 1.762758 -2.015585
H  0.428212 2.23741 -0.313122
H  -3.328827 1.893269 0.790741
H  -4.979964 1.349479 0.999669
H  3.692829 1.138263 1.253419
H  5.151005 0.310081 1.776931
H  4.773983 0.397908 0.059058
H  2.616235 2.878492 -2.362163
H  1.412911 3.998511 -1.731115
H  2.637875 3.338285 -0.650804
H  -4.147699 -0.699756 2.223679
H  -2.49641 -0.08503 2.089941
H  -3.689232 0.803713 3.024866
elementType: S P O C H
totalener: -2002.87117812 hartree
nucrepener: 1536.32235369 hartree
electener: -3539.19353182 hartree
oneelecener: -5815.81831098 hartree
twoeener: 2276.62477916 hartree
cpcmener: -0.01904027 hartree
kineticenergy: 1997.86550301 hartree
xcener: -120.681728554457 hartree
chargesum: -0.0000000
charge: -0.178206 -0.184630 -0.460398 0.653703 -0.364282 -0.339364 -0.099183 -0.122984 0.025961 0.047091 -0.099808 -0.237091 -0.253532 -0.249255 0.118203 0.131008 0.124461 0.093622 0.095347 0.110867 0.103495 0.094830 0.094351 0.108785 0.073942 0.100847 0.091167 0.091162 0.092755 0.088019 0.082920 0.068222 0.097974
qa: -0.1782 -0.1846 -0.4604 0.6537 -0.3643 -0.3394 -0.0992 -0.1230 0.0260 0.0471 -0.0998 -0.2371 -0.2535 -0.2493 0.1182 0.1310 0.1245 0.0936 0.0953 0.1109 0.1035 0.0948 0.0944 0.1088 0.0739 0.1008 0.0912 0.0912 0.0928 0.0880 0.0829 0.0682 0.0980
va: 2.2976 2.1750 1.9766 5.3908 2.1101 2.0711 3.8633 3.9372 3.8696 3.8140 3.9536 3.8876 3.9660 3.8928 1.0333 1.0167 1.0151 1.0289 1.0069 0.9899 0.9910 1.0051 1.0100 1.0008 1.0185 1.0095 1.0069 1.0032 1.0069 1.0041 1.0160 1.0164 1.0066
dispcorr: -0.016082960 hartree
energy: -2002.887261082767
dipole: 1.03796 -0.46116 0.57680 12.93118 -11.88907 1.04211 4.46676 -4.47269 -0.00593
magnitude: 1.19110 au
magnitude: 3.02754 debye
