program: Orca
programVersion: 5.0.4
elementType: S S S P O O C C C C C C C C H H H H H H H H H H H H H H H H H H H
charge: 0
multiplicity: 1
keywords: wb97x-d3
keywords: def2-TZVPP
keywords: def2/J RIJCOSX
keywords: DEFGRID2
keywords: scfconv7
keywords: smallprint printgap noloewdin
keywords: NOSOSCF
formula: C8H19O2PS3
InChI: InChI=1/C8H19O2PS3/c1-4-9-11(12,10-5-2)14-8-7-13-6-3/h4-8H2,1-3H3
33 atoms
S  0.60237 -0.715035 -1.370643
S  -3.53619 -1.461834 0.026283
S  -0.014647 1.631258 1.054762
P  1.291044 0.553044 0.135584
O  2.09124 -0.363108 1.168853
O  2.462776 1.321931 -0.644003
C  -0.833119 -1.479764 -0.515298
C  -2.12315 -0.771952 -0.877022
C  3.061915 -1.358987 0.769147
C  2.280623 2.623276 -1.242313
C  -3.367194 -0.594241 1.615622
C  2.534759 -2.741058 1.057486
C  1.450701 2.579078 -2.500809
C  -3.842185 0.843813 1.572967
H  -0.649846 -1.476035 0.558852
H  -0.851675 -2.519278 -0.839078
H  -2.33825 -0.895068 -1.938979
H  -2.051361 0.298116 -0.681136
H  3.32199 -1.2542 -0.285911
H  3.960137 -1.150484 1.349874
H  1.84097 3.297371 -0.505291
H  3.290191 2.970116 -1.455134
H  -3.955799 -1.172772 2.329008
H  -2.328414 -0.654664 1.944552
H  1.666444 -2.979559 0.442024
H  3.312235 -3.472394 0.833965
H  2.261107 -2.855452 2.106826
H  1.445386 3.572605 -2.95012
H  1.863871 1.884204 -3.231898
H  0.415555 2.301797 -2.301707
H  -3.270985 1.43665 0.858153
H  -4.895516 0.904826 1.300195
H  -3.720347 1.309804 2.552883
elementType: S P O C H
totalener: -2002.87213318 hartree
nucrepener: 1549.39942293 hartree
electener: -3552.27155611 hartree
oneelecener: -5842.08737043 hartree
twoeener: 2289.81581432 hartree
cpcmener: -0.01941253 hartree
kineticenergy: 1997.84479487 hartree
xcener: -120.679824463854 hartree
chargesum: 0.0000000
charge: -0.187934 -0.189299 -0.454231 0.660194 -0.357015 -0.359358 -0.103116 -0.117221 0.032629 0.037192 -0.092128 -0.236461 -0.246444 -0.261003 0.112291 0.135298 0.128725 0.095928 0.092624 0.108301 0.094639 0.110317 0.110126 0.086080 0.077614 0.098756 0.092645 0.103175 0.092252 0.074623 0.078166 0.086768 0.095867
qa: -0.1879 -0.1893 -0.4542 0.6602 -0.3570 -0.3594 -0.1031 -0.1172 0.0326 0.0372 -0.0921 -0.2365 -0.2464 -0.2610 0.1123 0.1353 0.1287 0.0959 0.0926 0.1083 0.0946 0.1103 0.1101 0.0861 0.0776 0.0988 0.0926 0.1032 0.0923 0.0746 0.0782 0.0868 0.0959
va: 2.2550 2.1567 2.0002 5.4201 2.0947 2.0825 3.8449 3.9524 3.8716 3.8534 3.9157 3.9230 3.8888 3.9144 1.0215 1.0140 1.0116 1.0296 1.0024 0.9971 1.0118 0.9904 1.0054 1.0227 1.0086 1.0091 1.0034 1.0117 1.0029 1.0172 1.0036 1.0149 1.0035
dispcorr: -0.016249486 hartree
energy: -2002.888382663074
dipole: -2.10836 3.48080 1.37243 -1.11876 0.62300 -0.49576 -0.14359 -0.64306 -0.78665
magnitude: 1.65776 au
magnitude: 4.21369 debye
