program: Orca
programVersion: 5.0.4
elementType: S S S P O O C C C C C C C C H H H H H H H H H H H H H H H H H H H
charge: 0
multiplicity: 1
keywords: wb97x-d3
keywords: def2-TZVPP
keywords: def2/J RIJCOSX
keywords: DEFGRID2
keywords: scfconv7
keywords: smallprint printgap noloewdin
keywords: NOSOSCF
formula: C8H19O2PS3
InChI: InChI=1/C8H19O2PS3/c1-4-9-11(12,10-5-2)14-8-7-13-6-3/h4-8H2,1-3H3
33 atoms
S  -0.264115 1.154912 1.606861
S  -3.887583 -0.832386 -0.034878
S  2.986125 0.70061 1.300123
P  1.276752 0.325547 0.495302
O  0.850272 -1.21195 0.377445
O  1.080224 0.804487 -1.02521
C  -1.752933 0.814631 0.586079
C  -2.430528 -0.48058 0.984073
C  1.79205 -2.246756 0.017428
C  1.687854 2.002082 -1.547603
C  -3.143069 -1.184492 -1.656673
C  2.218314 -2.188781 -1.428384
C  1.0692 3.268221 -1.007605
C  -2.199279 -2.369777 -1.674132
H  -1.465621 0.829985 -0.463988
H  -2.413689 1.665074 0.752965
H  -2.801246 -0.414996 2.007793
H  -1.74054 -1.321951 0.949659
H  2.654087 -2.189292 0.68497
H  1.266103 -3.175806 0.228136
H  2.760602 1.97461 -1.347676
H  1.545759 1.932861 -2.624637
H  -3.998304 -1.369189 -2.308997
H  -2.650898 -0.289209 -2.038807
H  2.807506 -3.07891 -1.650801
H  1.360525 -2.181103 -2.101114
H  2.842695 -1.321821 -1.643442
H  1.493945 4.117374 -1.543917
H  -0.01067 3.285783 -1.156133
H  1.277773 3.410564 0.052281
H  -1.869871 -2.565009 -2.696179
H  -1.305428 -2.188199 -1.07849
H  -2.683687 -3.270317 -1.297658
elementType: S P O C H
totalener: -2002.87335746 hartree
nucrepener: 1558.77740315 hartree
electener: -3561.65076061 hartree
oneelecener: -5860.38227870 hartree
twoeener: 2298.73151809 hartree
cpcmener: -0.02055954 hartree
kineticenergy: 1997.84798256 hartree
xcener: -120.681054624671 hartree
chargesum: -0.0000000
charge: -0.167629 -0.185835 -0.457571 0.633154 -0.349785 -0.354704 -0.101344 -0.145289 0.014065 0.045556 -0.113404 -0.241211 -0.253625 -0.232169 0.116259 0.132042 0.130126 0.110018 0.107458 0.111103 0.094849 0.111406 0.112552 0.095052 0.103318 0.090669 0.080107 0.105721 0.095218 0.076807 0.098320 0.054727 0.084038
qa: -0.1676 -0.1858 -0.4576 0.6332 -0.3498 -0.3547 -0.1013 -0.1453 0.0141 0.0456 -0.1134 -0.2412 -0.2536 -0.2322 0.1163 0.1320 0.1301 0.1100 0.1075 0.1111 0.0948 0.1114 0.1126 0.0951 0.1033 0.0907 0.0801 0.1057 0.0952 0.0768 0.0983 0.0547 0.0840
va: 2.2823 2.1734 2.0054 5.4089 2.0839 2.0458 3.8515 3.9730 3.8356 3.8211 3.9535 3.9048 3.9199 3.8972 1.0288 1.0155 1.0069 1.0198 1.0133 0.9905 1.0139 0.9909 1.0005 1.0064 1.0091 1.0013 1.0160 1.0122 1.0013 1.0163 1.0053 1.0105 1.0178
dispcorr: -0.017192560 hartree
energy: -2002.890550015840
dipole: -3.64241 3.30504 -0.33737 -6.18910 5.86807 -0.32103 -17.41102 15.29579 -2.11524
magnitude: 2.16590 au
magnitude: 5.50527 debye
