program: Orca
programVersion: 5.0.4
elementType: S S S P O O C C C C C C C C H H H H H H H H H H H H H H H H H H H
charge: 0
multiplicity: 1
keywords: wb97x-d3
keywords: def2-TZVPP
keywords: def2/J RIJCOSX
keywords: DEFGRID2
keywords: scfconv7
keywords: smallprint printgap noloewdin
keywords: NOSOSCF
formula: C8H19O2PS3
InChI: InChI=1/C8H19O2PS3/c1-4-9-11(12,10-5-2)14-8-7-13-6-3/h4-8H2,1-3H3
33 atoms
S  -0.412996 1.879124 0.675156
S  -3.756165 -0.847118 -0.323766
S  2.764522 1.206812 1.26441
P  1.166413 0.56332 0.403273
O  0.557867 -0.826736 0.908594
O  1.279275 0.279985 -1.174186
C  -1.766348 1.058671 -0.258067
C  -2.649658 0.215611 0.643207
C  1.382962 -1.975952 1.206822
C  2.109936 1.072053 -2.046186
C  -2.591126 -2.15678 -0.810563
C  1.907509 -2.667008 -0.02737
C  1.597441 2.477483 -2.246153
C  -2.251335 -3.120404 0.309315
H  -1.326154 0.481969 -1.069662
H  -2.336992 1.864779 -0.717982
H  -3.283043 0.855345 1.258229
H  -2.06435 -0.399648 1.325339
H  2.199373 -1.668737 1.863611
H  0.729909 -2.638763 1.771298
H  3.129853 1.080769 -1.657355
H  2.114286 0.526337 -2.987758
H  -3.073811 -2.683309 -1.635058
H  -1.688952 -1.699909 -1.22182
H  2.660219 -2.075512 -0.547399
H  2.377745 -3.603525 0.273914
H  1.103655 -2.907595 -0.723982
H  2.194297 2.955798 -3.023385
H  0.556889 2.486244 -2.570725
H  1.687143 3.081549 -1.343961
H  -1.510615 -3.846354 -0.031834
H  -1.83174 -2.610257 1.176496
H  -3.132926 -3.669479 0.639093
elementType: S P O C H
totalener: -2002.87326723 hartree
nucrepener: 1566.14915835 hartree
electener: -3569.02242558 hartree
oneelecener: -5875.12944547 hartree
twoeener: 2306.10701989 hartree
cpcmener: -0.02058545 hartree
kineticenergy: 1997.84404337 hartree
xcener: -120.679411200591 hartree
chargesum: -0.0000000
charge: -0.168825 -0.186778 -0.455353 0.631440 -0.347237 -0.351013 -0.118447 -0.136245 0.010147 0.044735 -0.084786 -0.243106 -0.251099 -0.282453 0.115021 0.139749 0.134325 0.104502 0.105503 0.109159 0.093012 0.110681 0.112116 0.085046 0.085122 0.104215 0.089017 0.105186 0.093725 0.076525 0.096044 0.083169 0.096904
qa: -0.1688 -0.1868 -0.4554 0.6314 -0.3472 -0.3510 -0.1184 -0.1362 0.0101 0.0447 -0.0848 -0.2431 -0.2511 -0.2825 0.1150 0.1397 0.1343 0.1045 0.1055 0.1092 0.0930 0.1107 0.1121 0.0850 0.0851 0.1042 0.0890 0.1052 0.0937 0.0765 0.0960 0.0832 0.0969
va: 2.2753 2.1605 2.0132 5.4165 2.0849 2.0465 3.8531 3.9387 3.8486 3.8239 3.9087 3.8999 3.9149 3.9279 1.0281 1.0106 1.0067 1.0224 1.0143 0.9867 1.0142 0.9908 1.0044 1.0214 1.0148 1.0085 1.0017 1.0118 1.0026 1.0166 1.0025 0.9995 1.0144
dispcorr: -0.017746952 hartree
energy: -2002.891014180774
dipole: -1.87461 1.81354 -0.06107 -14.43968 13.14635 -1.29334 -9.79954 8.33489 -1.46465
magnitude: 1.95491 au
magnitude: 4.96898 debye
