program: Orca
programVersion: 5.0.4
elementType: S S S P O O C C C C C C C C H H H H H H H H H H H H H H H H H H H
charge: 0
multiplicity: 1
keywords: wb97x-d3
keywords: def2-TZVPP
keywords: def2/J RIJCOSX
keywords: DEFGRID2
keywords: scfconv7
keywords: smallprint printgap noloewdin
keywords: NOSOSCF
formula: C8H19O2PS3
InChI: InChI=1/C8H19O2PS3/c1-4-9-11(12,10-5-2)14-8-7-13-6-3/h4-8H2,1-3H3
33 atoms
S  -0.088234 0.099873 -1.3522
S  -3.50538 -0.486836 1.425163
S  0.971757 2.021927 1.257167
P  1.361569 0.546643 0.085075
O  1.642195 -0.787591 0.918122
O  2.659865 0.656173 -0.847327
C  -1.628648 0.36538 -0.40631
C  -1.885081 -0.701123 0.639353
C  1.934994 -2.067408 0.312511
C  3.17459 1.916845 -1.326062
C  -4.609107 -1.154295 0.143416
C  3.40648 -2.383956 0.403407
C  2.3331 2.523602 -2.420653
C  -4.564045 -2.664211 0.022203
H  -2.404445 0.36361 -1.173062
H  -1.596838 1.361317 0.034352
H  -1.153639 -0.636609 1.445595
H  -1.807355 -1.701331 0.211438
H  1.344631 -2.795216 0.867607
H  1.589685 -2.092449 -0.723058
H  3.273898 2.60395 -0.484084
H  4.173694 1.684461 -1.68979
H  -5.608443 -0.823243 0.429797
H  -4.387144 -0.674825 -0.811344
H  3.756024 -2.368411 1.435536
H  3.575484 -3.387024 0.010825
H  4.010984 -1.691741 -0.181125
H  1.349538 2.827439 -2.063087
H  2.839637 3.415559 -2.790779
H  2.204811 1.83978 -3.259312
H  -3.570451 -3.020773 -0.250287
H  -4.850895 -3.144614 0.957066
H  -5.254295 -2.999149 -0.75423
elementType: S P O C H
totalener: -2002.87287807 hartree
nucrepener: 1519.29876560 hartree
electener: -3522.17164367 hartree
oneelecener: -5781.88873482 hartree
twoeener: 2259.71709115 hartree
cpcmener: -0.02231937 hartree
kineticenergy: 1997.85261220 hartree
xcener: -120.680816142753 hartree
chargesum: 0.0000000
charge: -0.180251 -0.179127 -0.450770 0.641334 -0.358222 -0.353582 -0.095253 -0.139191 0.048480 0.034250 -0.099873 -0.248149 -0.244333 -0.253540 0.136669 0.111596 0.115246 0.113576 0.107596 0.095036 0.094091 0.106937 0.106287 0.095720 0.087835 0.095144 0.083310 0.075454 0.102991 0.090766 0.086548 0.079457 0.093969
qa: -0.1803 -0.1791 -0.4508 0.6413 -0.3582 -0.3536 -0.0953 -0.1392 0.0485 0.0342 -0.0999 -0.2481 -0.2443 -0.2535 0.1367 0.1116 0.1152 0.1136 0.1076 0.0950 0.0941 0.1069 0.1063 0.0957 0.0878 0.0951 0.0833 0.0755 0.1030 0.0908 0.0865 0.0795 0.0940
va: 2.2814 2.1711 2.0085 5.4194 2.0812 2.0920 3.8363 3.9477 3.8242 3.8603 3.9455 3.9566 3.8870 3.9162 1.0060 1.0428 1.0267 1.0145 0.9901 1.0098 1.0116 0.9903 1.0012 1.0078 1.0037 1.0063 1.0123 1.0182 1.0108 1.0040 1.0019 1.0126 1.0047
dispcorr: -0.014999826 hartree
energy: -2002.887877893876
dipole: -3.58038 3.73248 0.15210 -11.44428 9.95716 -1.48712 -8.72334 6.53991 -2.18344
magnitude: 2.64614 au
magnitude: 6.72596 debye
