program: Orca
programVersion: 5.0.4
elementType: S S S P O O C C C C C C C C H H H H H H H H H H H H H H H H H H H
charge: 0
multiplicity: 1
keywords: wb97x-d3
keywords: def2-TZVPP
keywords: def2/J RIJCOSX
keywords: DEFGRID2
keywords: scfconv7
keywords: smallprint printgap noloewdin
keywords: NOSOSCF
formula: C8H19O2PS3
InChI: InChI=1/C8H19O2PS3/c1-4-9-11(12,10-5-2)14-8-7-13-6-3/h4-8H2,1-3H3
33 atoms
S  -0.73857 0.783805 -1.209076
S  -3.421809 -1.091629 0.036575
S  1.317848 1.655428 1.381717
P  1.032518 0.517437 -0.150099
O  1.032957 -1.059391 0.129482
O  2.12908 0.62366 -1.314893
C  -1.898738 1.258113 0.113419
C  -2.419292 0.110562 0.953671
C  2.153111 -1.672877 0.813174
C  2.886043 1.822412 -1.572546
C  -2.245632 -2.436072 -0.300446
C  1.776298 -2.049806 2.2223
C  2.063233 2.911878 -2.214371
C  -1.843002 -3.223487 0.929352
H  -2.715833 1.754845 -0.410254
H  -1.411098 2.005795 0.741348
H  -3.066616 0.53457 1.72407
H  -1.613049 -0.400225 1.481542
H  2.4133 -2.552017 0.225208
H  3.019815 -1.008771 0.809136
H  3.336738 2.170515 -0.641432
H  3.689434 1.502873 -2.233944
H  -2.765597 -3.081173 -1.010923
H  -1.378081 -2.032443 -0.819862
H  2.622262 -2.549175 2.695273
H  1.529625 -1.170643 2.81631
H  0.931004 -2.736822 2.242655
H  2.72215 3.742634 -2.468044
H  1.586641 2.570057 -3.132679
H  1.294068 3.294313 -1.543676
H  -1.353178 -2.595315 1.673591
H  -2.707651 -3.689576 1.400918
H  -1.140243 -4.012726 0.655874
elementType: S P O C H
totalener: -2002.87077173 hartree
nucrepener: 1575.58370390 hartree
electener: -3578.45447564 hartree
oneelecener: -5894.70081414 hartree
twoeener: 2316.24633851 hartree
cpcmener: -0.01778382 hartree
kineticenergy: 1997.87028443 hartree
xcener: -120.685347806402 hartree
chargesum: 0.0000000
charge: -0.157801 -0.191641 -0.464642 0.662618 -0.351560 -0.373725 -0.113421 -0.101234 0.038727 0.043726 -0.091441 -0.258482 -0.246448 -0.277891 0.124556 0.125807 0.126463 0.086534 0.109777 0.094928 0.093218 0.109474 0.114358 0.084797 0.103698 0.079178 0.093738 0.103143 0.090514 0.074396 0.078240 0.090513 0.099882
qa: -0.1578 -0.1916 -0.4646 0.6626 -0.3516 -0.3737 -0.1134 -0.1012 0.0387 0.0437 -0.0914 -0.2585 -0.2464 -0.2779 0.1246 0.1258 0.1265 0.0865 0.1098 0.0949 0.0932 0.1095 0.1144 0.0848 0.1037 0.0792 0.0937 0.1031 0.0905 0.0744 0.0782 0.0905 0.0999
va: 2.3021 2.1403 1.9757 5.3850 2.0759 2.0852 3.8911 3.9190 3.8521 3.8493 3.8965 3.9334 3.8996 3.9298 1.0130 1.0352 1.0080 1.0252 0.9968 1.0067 1.0135 0.9914 1.0034 1.0378 1.0101 1.0163 0.9985 1.0106 1.0051 1.0179 0.9990 1.0172 1.0013
dispcorr: -0.017056861 hartree
energy: -2002.887828595624
dipole: 3.75973 -2.59036 1.16937 -8.53084 8.16235 -0.36849 4.13704 -4.22981 -0.09277
magnitude: 1.22955 au
magnitude: 3.12528 debye
