program: Orca
programVersion: 5.0.4
elementType: S S S P O O C C C C C C C C H H H H H H H H H H H H H H H H H H H
charge: 0
multiplicity: 1
keywords: wb97x-d3
keywords: def2-TZVPP
keywords: def2/J RIJCOSX
keywords: DEFGRID2
keywords: scfconv7
keywords: smallprint printgap noloewdin
keywords: NOSOSCF
formula: C8H19O2PS3
InChI: InChI=1/C8H19O2PS3/c1-4-9-11(12,10-5-2)14-8-7-13-6-3/h4-8H2,1-3H3
33 atoms
S  0.342189 -1.090146 -1.61958
S  -3.197196 -1.898178 0.951974
S  -0.544758 1.984736 -0.390175
P  0.845523 0.671388 -0.618009
O  1.460416 0.27169 0.808501
O  2.083209 1.066151 -1.556511
C  -1.377938 -1.317828 -1.033176
C  -1.472635 -1.770657 0.409637
C  2.560204 -0.658487 0.950823
C  2.620905 2.407154 -1.587835
C  -3.59534 -0.147945 1.245912
C  2.105359 -1.917505 1.644209
C  3.304208 2.802428 -0.301985
C  -2.92395 0.440368 2.470263
H  -1.793093 -2.071801 -1.701974
H  -1.910736 -0.384369 -1.21179
H  -0.93657 -1.103301 1.08404
H  -1.032107 -2.761033 0.527353
H  3.007925 -0.889651 -0.017917
H  3.315803 -0.139114 1.540182
H  3.328166 2.396172 -2.414776
H  1.819681 3.104553 -1.839039
H  -3.356486 0.432965 0.353576
H  -4.680713 -0.120258 1.354525
H  1.651963 -1.703162 2.612294
H  1.392776 -2.477732 1.039053
H  2.97239 -2.556156 1.816845
H  4.069418 2.080858 -0.014682
H  3.793765 3.765641 -0.450087
H  2.600434 2.917687 0.522398
H  -3.201859 -0.101329 3.374294
H  -1.837249 0.428356 2.385534
H  -3.224858 1.482296 2.595438
elementType: S P O C H
totalener: -2002.87314019 hartree
nucrepener: 1562.84411328 hartree
electener: -3565.71725347 hartree
oneelecener: -5868.93687518 hartree
twoeener: 2303.21962171 hartree
cpcmener: -0.01999524 hartree
kineticenergy: 1997.84043529 hartree
xcener: -120.678793325739 hartree
chargesum: -0.0000000
charge: -0.173918 -0.183409 -0.448672 0.633592 -0.343890 -0.359324 -0.100060 -0.141850 0.036097 0.027030 -0.095847 -0.244051 -0.250863 -0.259254 0.133724 0.118666 0.094487 0.133335 0.094917 0.107443 0.110172 0.097101 0.088273 0.112826 0.095377 0.074146 0.105171 0.091171 0.106878 0.084657 0.085685 0.073227 0.097163
qa: -0.1739 -0.1834 -0.4487 0.6336 -0.3439 -0.3593 -0.1001 -0.1418 0.0361 0.0270 -0.0958 -0.2441 -0.2509 -0.2593 0.1337 0.1187 0.0945 0.1333 0.0949 0.1074 0.1102 0.0971 0.0883 0.1128 0.0954 0.0741 0.1052 0.0912 0.1069 0.0847 0.0857 0.0732 0.0972
va: 2.2853 2.1700 2.0138 5.4026 2.0319 2.0787 3.8474 3.9688 3.8555 3.8612 3.9269 3.9359 3.8854 3.9104 1.0130 1.0312 1.0197 1.0060 1.0001 0.9925 0.9910 1.0098 1.0164 1.0028 1.0024 1.0123 1.0100 1.0042 1.0089 1.0185 1.0165 1.0127 1.0035
dispcorr: -0.017432200 hartree
energy: -2002.890572385659
dipole: 5.33790 -3.47271 1.86518 0.96824 -1.18271 -0.21446 11.88976 -11.69342 0.19633
magnitude: 1.88771 au
magnitude: 4.79818 debye
