program: Orca
programVersion: 5.0.4
elementType: S S S P O O C C C C C C C C H H H H H H H H H H H H H H H H H H H
charge: 0
multiplicity: 1
keywords: wb97x-d3
keywords: def2-TZVPP
keywords: def2/J RIJCOSX
keywords: DEFGRID2
keywords: scfconv7
keywords: smallprint printgap noloewdin
keywords: NOSOSCF
formula: C8H19O2PS3
InChI: InChI=1/C8H19O2PS3/c1-4-9-11(12,10-5-2)14-8-7-13-6-3/h4-8H2,1-3H3
33 atoms
S  -0.037857 -1.257173 -1.545282
S  -2.385413 -1.643354 0.911794
S  -0.001072 2.172865 -1.707744
P  0.758702 0.572991 -0.949579
O  0.685473 0.640396 0.651162
O  2.28152 0.238692 -1.317343
C  -1.808253 -0.835792 -1.682821
C  -2.499201 -0.402706 -0.406839
C  1.151705 -0.435766 1.494442
C  3.275084 1.274779 -1.460049
C  -2.548777 -0.561639 2.363895
C  1.323963 0.10343 2.891003
C  3.602858 1.971312 -0.16148
C  -2.257494 -1.346049 3.627995
H  -2.259699 -1.741324 -2.090773
H  -1.915272 -0.054943 -2.436098
H  -3.545813 -0.209794 -0.649776
H  -2.079896 0.536143 -0.043081
H  0.413196 -1.239172 1.467517
H  2.099742 -0.827278 1.119864
H  4.150718 0.762276 -1.854228
H  2.937958 1.989923 -2.213085
H  -1.844485 0.265255 2.25705
H  -3.554218 -0.140049 2.395827
H  2.078469 0.889937 2.925563
H  0.389377 0.498116 3.291122
H  1.65265 -0.704105 3.545102
H  2.767011 2.560306 0.21579
H  3.911495 1.263719 0.608239
H  4.432246 2.657254 -0.335364
H  -2.362385 -0.69758 4.498073
H  -2.947608 -2.180654 3.753964
H  -1.241612 -1.742675 3.627559
elementType: S P O C H
totalener: -2002.87114080 hartree
nucrepener: 1580.62719813 hartree
electener: -3583.49833893 hartree
oneelecener: -5904.73794463 hartree
twoeener: 2321.23960569 hartree
cpcmener: -0.02041900 hartree
kineticenergy: 1997.86030401 hartree
xcener: -120.683898990358 hartree
chargesum: 0.0000000
charge: -0.160629 -0.171728 -0.453232 0.635155 -0.342401 -0.361949 -0.125453 -0.111845 -0.012106 0.027143 -0.108100 -0.266486 -0.250102 -0.277350 0.137111 0.127293 0.122539 0.077518 0.110631 0.136872 0.109946 0.096397 0.091686 0.115310 0.099368 0.089980 0.097986 0.081508 0.090749 0.107023 0.101131 0.098392 0.087644
qa: -0.1606 -0.1717 -0.4532 0.6352 -0.3424 -0.3619 -0.1255 -0.1118 -0.0121 0.0271 -0.1081 -0.2665 -0.2501 -0.2773 0.1371 0.1273 0.1225 0.0775 0.1106 0.1369 0.1099 0.0964 0.0917 0.1153 0.0994 0.0900 0.0980 0.0815 0.0907 0.1070 0.1011 0.0984 0.0876
va: 2.2844 2.1835 2.0095 5.3985 2.0225 2.0801 3.9139 3.9555 3.7713 3.8601 3.9569 3.9540 3.8895 3.9343 1.0025 1.0247 1.0060 1.0343 1.0245 0.9983 0.9912 1.0102 1.0037 1.0015 1.0056 0.9982 1.0031 1.0203 1.0038 1.0095 1.0005 1.0058 1.0014
dispcorr: -0.017523662 hartree
energy: -2002.888664466086
dipole: 2.37472 -1.80195 0.57277 0.82399 -1.10192 -0.27793 20.65938 -19.36500 1.29437
magnitude: 1.44246 au
magnitude: 3.66645 debye
