program: Gaussian 09
title: 000065567
version: EM64L-G09RevD.01
frameworkgroup: C1[X(C20H15N3O6)]
method: RPBEPBE
basis: SDD
operation: Freq
keyword: #p
keyword: freq=noraman
keyword: PBEPBE/SDD
title: #p freq=noraman PBEPBE/SDD
converged: YES YES NO NO
title: Mulliken charges:
elementType: O O O O O O N N N C C C C C C C C C C C C C C C C C C C C H H H H H H H H H H H H H H H
charge: -0.185593 -0.474509 -0.273154 -0.236861 -0.197503 -0.202076 -0.266073 0.047576 0.021196 -0.048586 0.448624 0.432876 0.006632 -0.502548 -0.465199 0.392557 -0.314504 0.019088 -0.392104 -0.464141 0.158140 -0.480282 0.492994 -0.700424 -0.073072 -0.548126 -0.293934 0.384858 -0.374569 0.279253 0.281214 0.320136 0.240886 0.214492 0.290576 0.246984 0.270375 0.224467 0.240509 0.234031 0.374475 0.295897 0.280270 0.295154
chargesum: 0.00000
title: Mulliken charges with hydrogens summed into heavy atoms:
elementType: O O O O O O N N N C C C C C C C C C C C C C C C C C C C C
charge: -0.185593 -0.100034 -0.273154 -0.236861 -0.197503 -0.202076 -0.266073 0.047576 0.021196 -0.048586 0.448624 0.432876 0.006632 0.057919 -0.145063 0.392557 -0.314504 0.019088 0.063273 0.073419 0.158140 -0.209907 0.492994 -0.001417 -0.073072 -0.252229 -0.013665 0.384858 -0.079415
polarizability: 5.53237579e+02 -2.87998181e+01 2.77021903e+02 -1.58733001e-01 9.11037210e+00 1.28483698e+02
1716.lowfreq: -4.4061 -0.8786 -0.0005 0.0004 0.0005 2.9732 23.7245 41.5888 49.7619
frequency: 23.6697 41.5823 49.7602 62.8760 63.7675 84.2227 95.3101 106.5691 129.7972 144.9483 158.6988 165.9837 189.4914 209.2872 218.4823 230.0213 247.1608 271.6271 280.6969 288.4284 290.9557 320.8475 331.4514 339.7550 360.4863 374.1800 409.2870 424.3001 444.8663 456.4302 474.2160 483.8257 509.9112 520.2605 532.0128 547.7315 582.9246 590.3084 603.5613 624.6393 635.6187 643.2115 680.3271 697.5116 701.9258 715.8179 724.0338 748.9781 756.4104 771.0843 776.7442 783.5082 791.2772 802.2953 866.6503 883.9315 892.0346 895.7589 908.9602 932.4075 945.2203 950.8396 968.0288 977.3680 990.5005 997.2975 1004.2478 1057.4686 1062.0521 1075.0276 1091.0323 1104.8767 1109.7462 1133.4182 1152.4342 1163.6590 1167.9644 1178.7848 1194.4793 1204.8444 1210.8148 1229.9609 1241.6640 1249.9562 1272.0436 1274.3610 1295.2732 1304.5703 1339.2572 1348.9619 1365.9041 1381.6898 1383.6335 1395.0179 1402.9950 1418.9890 1432.2967 1451.0618 1459.4088 1465.1251 1468.0137 1475.6014 1486.7330 1500.2564 1539.8643 1563.5166 1572.8873 1618.4741 1629.3468 1636.6006 1645.8836 2991.9747 2995.8150 2997.3883 3005.0434 3050.3990 3052.6184 3086.5789 3098.7956 3104.8820 3141.3942 3162.8281 3170.0364 3192.1040 3211.0994 3444.8611
redmass: 8.0423 6.5747 6.0910 6.8748 6.4371 3.5121 6.5517 4.8835 5.3996 6.0553 4.1679 4.7534 2.6489 2.9068 5.8073 8.1113 2.2224 3.5833 3.1653 5.9177 2.8369 5.9863 5.8155 5.2464 6.2841 5.6237 3.7703 2.6696 1.5055 5.5803 5.4118 3.1861 6.2465 6.1750 5.4378 6.6537 6.1058 7.6253 5.9990 7.8172 7.2843 6.0989 5.4414 5.8121 5.7989 5.9542 5.3597 5.2627 6.0521 1.7523 5.0896 5.5961 3.9300 2.8349 1.8209 1.7278 2.1887 2.0247 2.6091 4.1931 4.0559 1.6102 2.6394 2.2297 3.3107 1.8543 1.3350 2.8869 3.7596 2.2361 2.9839 2.6880 2.5040 1.5946 2.3049 1.1089 2.3612 1.2697 1.8685 3.9918 3.1641 5.7402 2.5874 2.6396 2.3169 1.2557 2.2311 1.4079 1.8681 1.6454 4.4829 3.2879 4.1982 1.2128 4.0100 5.2657 4.0030 1.0927 2.5858 1.4513 1.1714 1.0456 1.0508 5.3125 8.5383 9.6083 10.2960 7.4281 8.3243 10.8346 9.3461 1.0384 1.0591 1.0659 1.0598 1.1014 1.1030 1.0997 1.1004 1.0961 1.0937 1.0924 1.0896 1.0970 1.0936 1.0649
irintensity: 0.9795 0.2313 1.2750 0.6124 0.2355 0.9100 1.9343 0.4427 0.2500 2.7209 4.6523 11.5195 2.1421 1.1603 5.2035 6.1381 5.7069 6.1455 0.6271 1.5190 9.0336 6.3885 16.0837 4.0220 3.6484 8.0652 0.7945 30.7866 68.4675 0.5806 14.1142 6.6297 5.8755 2.6067 0.7877 1.8721 9.3443 8.9846 2.3813 3.4971 1.6356 8.7996 8.7106 10.8448 11.6658 7.2069 1.5101 3.1058 6.2377 5.5758 24.9943 7.3924 9.2101 0.0866 37.1663 46.3759 9.8226 3.5567 11.3951 14.0565 14.6036 29.3223 34.6206 40.9157 30.5065 9.3366 0.0042 15.0562 42.8872 47.8008 83.1738 116.3443 0.4564 12.6980 36.6828 2.3893 7.7752 43.8126 21.6978 267.8541 398.3787 9.3508 8.2880 2.4923 5.1271 2.9601 3.1477 19.7197 15.8589 30.4119 124.3788 6.9233 105.6973 15.3433 12.3861 13.5845 51.6373 5.5460 74.5177 24.2403 17.9340 14.6710 9.4047 0.2427 64.5936 10.8003 240.0774 193.5732 32.9488 381.7195 57.6229 39.5842 4.3069 27.7478 3.4996 6.8177 2.0465 26.9707 22.0408 0.9496 3.9299 1.2525 2.4406 1.8146 11.6222 62.3704
temp: 298.150 k
press: 1.00000 atm
elementType: 8 8 8 8 8 8 7 7 7 6 6 6 6 6 6 6 6 6 6 6 6 6 6 6 6 6 6 6 6 1 1 1 1 1 1 1 1 1 1 1 1 1 1 1
symmnumber: 1
zpe: 838511.0 jmol-1
zpe.correction: 0.319372 hartree
zpe.thermalcorrener: 0.343103 hartree
zpe.thermalcorrenthalpy: 0.344047 hartree
zpe.thermalcorrgfe: 0.265926 hartree
zpe.sumelectzpe: -1384.647596 hartree
zpe.sumelectthermal: -1384.623865 hartree
zpe.sumelectthermalent: -1384.622921 hartree
zpe.sumelectthermalfe: -1384.701042 hartree
dipole: -0.5178 0.8833 2.8788
dipole: 3.0555
quadrupole: -230.5627 -168.4187 -167.1586
quadrupole: 8.9194 -17.4305 -1.8632
quadrupole: -41.8494 20.2946 21.5547 8.9194 -17.4305 -1.8632
hfenergy: -1384.966968 hartree
pointgroup: C01 [X(C20H15N3O6)]
dipole: -0.2039775 -0.2825255 -1.1504942 debye
polarizability: 554.4042482|22.0671115|274.4491543|4.4597887|16.94792|129.8897778 unknown
InChI: InChI=1S/C20H15N3O6/c1-2-20(26)14-7-16-17-11(8-22(16)18(24)13(14)9-29-19(20)25)5-10-6-12(23(27)28)3-4-15(10)21-17/h3-7,26H,2,8-9H2,1H3
charge 0 multiplicity 1
44 atoms
O  -5.606843 -0.598856 0.732668
O  -3.636647 2.534084 0.682167
O  -2.533933 -3.362618 -0.360308
O  -5.89075 1.448454 1.713914
O  7.93122 1.432093 0.235179
O  7.758464 -0.83074 -0.004151
N  -0.975445 -1.622543 -0.176919
N  1.581045 0.902257 0.117503
N  7.242123 0.347015 0.11564
C  -4.100288 1.304388 0.054191
C  -2.963517 0.288049 0.003611
C  -0.625345 -0.276733 -0.029851
C  -3.309379 -1.058436 -0.132199
C  0.201904 -2.528807 -0.256497
C  -1.599214 0.706977 0.06717
C  1.356375 -1.557027 -0.142328
C  0.840961 -0.212101 -0.007461
C  -2.304909 -2.114562 -0.232359
C  -4.596923 1.626801 -1.399517
C  -4.756418 -1.47259 -0.143085
C  -5.267176 0.730227 0.90154
C  2.728368 -1.75201 -0.147726
C  3.575401 -0.595597 -0.017773
C  -5.763582 2.631732 -1.444332
C  2.956549 0.717772 0.113608
C  4.996935 -0.695719 -0.014162
C  3.790348 1.875688 0.244741
C  5.761804 0.465188 0.11516
C  5.17803 1.761811 0.246579
H  0.179548 -3.0909 -1.208235
H  0.157174 -3.272704 0.560292
H  -1.335594 1.755053 0.208118
H  -3.720473 2.044273 -1.929983
H  -4.872249 0.689734 -1.920404
H  -4.877249 -2.488515 0.262481
H  -5.202495 -1.446498 -1.155723
H  3.177359 -2.746516 -0.246625
H  -6.010685 2.876463 -2.49251
H  -5.487289 3.569402 -0.932731
H  -6.676588 2.234268 -0.965984
H  -4.331015 2.804011 1.346973
H  5.498664 -1.663582 -0.110954
H  3.294188 2.845033 0.342982
H  5.833445 2.630381 0.3453
