program: Orca
programVersion: 5.0.4
elementType: S S S P O O C C C C C C C C H H H H H H H H H H H H H H H H H H H
charge: 0
multiplicity: 1
keywords: wb97x-d3
keywords: def2-TZVPP
keywords: def2/J RIJCOSX
keywords: DEFGRID2
keywords: scfconv7
keywords: smallprint printgap noloewdin
keywords: NOSOSCF
formula: C8H19O2PS3
InChI: InChI=1/C8H19O2PS3/c1-4-9-11(12,10-5-2)14-8-7-13-6-3/h4-8H2,1-3H3
33 atoms
S  0.027614 -0.143098 -1.464197
S  -3.233037 -0.752421 1.49145
S  0.797498 2.048744 1.016498
P  1.424344 0.615444 -0.1038
O  1.956976 -0.607268 0.772406
O  2.681426 0.875809 -1.060865
C  -1.53467 0.042056 -0.533892
C  -1.640256 -0.907467 0.642503
C  2.480067 -1.817871 0.179718
C  2.681864 1.883962 -2.094625
C  -4.323616 -1.650737 0.347633
C  2.028077 -2.993704 1.004381
C  3.269835 3.181796 -1.603228
C  -5.724746 -1.708486 0.926218
H  -2.306292 -0.157437 -1.278316
H  -1.627604 1.080989 -0.220608
H  -0.882121 -0.679096 1.392554
H  -1.491989 -1.942534 0.329644
H  2.131986 -1.925938 -0.849875
H  3.567181 -1.737973 0.160196
H  3.278804 1.464689 -2.902868
H  1.669633 2.032869 -2.477831
H  -4.335639 -1.152054 -0.622096
H  -3.926981 -2.656771 0.201578
H  2.366519 -2.917291 2.037573
H  0.941686 -3.088192 0.996622
H  2.447699 -3.906981 0.582395
H  3.338107 3.876294 -2.441316
H  2.648712 3.640819 -0.835446
H  4.273979 3.039883 -1.204296
H  -6.142294 -0.711811 1.069905
H  -6.384255 -2.248274 0.246457
H  -5.74177 -2.225136 1.885979
elementType: S P O C H
totalener: -2002.87363234 hartree
nucrepener: 1508.31637063 hartree
electener: -3511.19000297 hartree
oneelecener: -5759.96135313 hartree
twoeener: 2248.77135015 hartree
cpcmener: -0.02308072 hartree
kineticenergy: 1997.85343219 hartree
xcener: -120.679877213597 hartree
chargesum: -0.0000000
charge: -0.192677 -0.173774 -0.447226 0.640714 -0.348045 -0.352653 -0.089797 -0.127157 0.022430 0.044636 -0.117692 -0.231194 -0.244010 -0.252312 0.139132 0.111541 0.114304 0.109366 0.099176 0.109133 0.109358 0.087043 0.095964 0.097077 0.091233 0.081421 0.093200 0.096440 0.074948 0.089919 0.087686 0.094664 0.087148
qa: -0.1927 -0.1738 -0.4472 0.6407 -0.3480 -0.3527 -0.0898 -0.1272 0.0224 0.0446 -0.1177 -0.2312 -0.2440 -0.2523 0.1391 0.1115 0.1143 0.1094 0.0992 0.1091 0.1094 0.0870 0.0960 0.0971 0.0912 0.0814 0.0932 0.0964 0.0749 0.0899 0.0877 0.0947 0.0871
va: 2.2803 2.1938 2.0137 5.4344 2.0788 2.0877 3.8334 3.9550 3.8580 3.8476 4.0084 3.9368 3.9274 3.9140 1.0038 1.0441 1.0271 1.0186 1.0002 0.9975 0.9922 1.0098 0.9985 1.0001 1.0046 1.0065 1.0084 1.0081 1.0219 1.0040 1.0067 1.0027 1.0084
dispcorr: -0.014406854 hartree
energy: -2002.888039196739
dipole: -7.03262 7.11490 0.08229 -10.30612 8.59452 -1.71160 -4.12565 1.78892 -2.33672
magnitude: 2.89769 au
magnitude: 7.36535 debye
