program: Orca
programVersion: 5.0.4
elementType: S S S P O O C C C C C C C C H H H H H H H H H H H H H H H H H H H
charge: 0
multiplicity: 1
keywords: wb97x-d3
keywords: def2-TZVPP
keywords: def2/J RIJCOSX
keywords: DEFGRID2
keywords: scfconv7
keywords: smallprint printgap noloewdin
keywords: NOSOSCF
formula: C8H19O2PS3
InChI: InChI=1/C8H19O2PS3/c1-4-9-11(12,10-5-2)14-8-7-13-6-3/h4-8H2,1-3H3
33 atoms
S  0.32169 -0.171443 1.889282
S  -3.534417 -0.980756 -0.145416
S  3.05009 1.212059 0.725844
P  1.393118 0.38623 0.197254
O  1.468152 -0.914547 -0.734867
O  0.435853 1.224388 -0.772898
C  -1.117855 -1.057032 1.17258
C  -2.279709 -0.134071 0.854001
C  2.172787 -2.092511 -0.297847
C  0.438786 2.665835 -0.798801
C  -2.733064 -0.905831 -1.777515
C  2.277349 -3.037199 -1.467046
C  -0.161117 3.287544 0.438312
C  -2.806584 0.460864 -2.430567
H  -1.404529 -1.790342 1.926186
H  -0.780601 -1.614088 0.300079
H  -1.954107 0.763077 0.331004
H  -2.769262 0.193195 1.771303
H  3.16379 -1.810726 0.06451
H  1.62792 -2.554052 0.528297
H  1.46004 3.017222 -0.955704
H  -0.143879 2.922833 -1.681216
H  -1.697069 -1.238679 -1.682979
H  -3.244337 -1.650994 -2.38839
H  1.294306 -3.336115 -1.830433
H  2.837063 -2.593984 -2.28976
H  2.804753 -3.936116 -1.149687
H  0.433742 3.087438 1.329163
H  -0.193403 4.368485 0.301431
H  -1.179643 2.94212 0.613257
H  -2.337159 1.232227 -1.819323
H  -2.287226 0.44596 -3.390118
H  -3.839175 0.7576 -2.610468
elementType: S P O C H
totalener: -2002.87491412 hartree
nucrepener: 1563.90677569 hartree
electener: -3566.78168981 hartree
oneelecener: -5870.42066194 hartree
twoeener: 2303.63897213 hartree
cpcmener: -0.02192944 hartree
kineticenergy: 1997.85182009 hartree
xcener: -120.681047081269 hartree
chargesum: -0.0000000
charge: -0.173429 -0.189690 -0.452596 0.621836 -0.346324 -0.349568 -0.109329 -0.098862 0.022672 0.026310 -0.093355 -0.246065 -0.257439 -0.254732 0.139210 0.114893 0.065906 0.135252 0.107618 0.105137 0.108776 0.112338 0.086668 0.111265 0.089655 0.088875 0.090672 0.079085 0.108815 0.099941 0.072082 0.097230 0.087155
qa: -0.1734 -0.1897 -0.4526 0.6218 -0.3463 -0.3496 -0.1093 -0.0989 0.0227 0.0263 -0.0934 -0.2461 -0.2574 -0.2547 0.1392 0.1149 0.0659 0.1353 0.1076 0.1051 0.1088 0.1123 0.0867 0.1113 0.0897 0.0889 0.0907 0.0791 0.1088 0.0999 0.0721 0.0972 0.0872
va: 2.2781 2.1613 2.0158 5.4469 2.0882 2.0792 3.8623 3.9685 3.8233 3.8115 3.9291 3.9631 3.9026 3.9272 1.0101 1.0194 1.0344 1.0076 1.0070 0.9946 1.0166 0.9910 1.0183 1.0028 1.0025 1.0052 1.0057 1.0180 1.0109 0.9952 0.9999 1.0043 1.0139
dispcorr: -0.017304006 hartree
energy: -2002.892218125805
dipole: -9.50138 8.58405 -0.91733 -1.59726 1.04196 -0.55530 -11.91906 11.13455 -0.78451
magnitude: 1.32865 au
magnitude: 3.37715 debye
