program: Orca
programVersion: 5.0.4
elementType: S S S P O O C C C C C C C C H H H H H H H H H H H H H H H H H H H
charge: 0
multiplicity: 1
keywords: wb97x-d3
keywords: def2-TZVPP
keywords: def2/J RIJCOSX
keywords: DEFGRID2
keywords: scfconv7
keywords: smallprint printgap noloewdin
keywords: NOSOSCF
formula: C8H19O2PS3
InChI: InChI=1/C8H19O2PS3/c1-4-9-11(12,10-5-2)14-8-7-13-6-3/h4-8H2,1-3H3
33 atoms
S  0.305919 0.126658 1.853641
S  -3.678147 -0.651843 0.080449
S  3.300256 0.053291 0.520178
P  1.433118 0.285107 0.115358
O  0.788856 -0.676089 -0.9900
O  0.995214 1.661337 -0.578871
C  -1.401458 0.399235 1.228515
C  -2.132767 -0.908329 0.992529
C  1.334585 -1.976782 -1.293992
C  1.275774 2.924816 0.051654
C  -3.016945 -0.504857 -1.608761
C  1.10701 -2.994019 -0.203642
C  0.925126 4.019591 -0.921121
C  -2.581826 -1.827221 -2.209109
H  -1.351102 1.012472 0.330075
H  -1.904553 0.993667 1.990441
H  -2.394649 -1.375872 1.94195
H  -1.514655 -1.621175 0.449171
H  0.83028 -2.27461 -2.211664
H  2.39865 -1.874351 -1.512866
H  0.685851 3.010926 0.96682
H  2.332709 2.96844 0.324085
H  -3.820729 -0.062831 -2.199166
H  -2.198146 0.217306 -1.609617
H  0.048254 -3.12423 0.018824
H  1.495692 -3.955298 -0.541303
H  1.628032 -2.734382 0.717883
H  -0.13113 3.995984 -1.188807
H  1.131635 4.984769 -0.459302
H  1.51953 3.950579 -1.832095
H  -1.806267 -2.312421 -1.615519
H  -3.421184 -2.516985 -2.29131
H  -2.175302 -1.669763 -3.209774
elementType: S P O C H
totalener: -2002.87481635 hartree
nucrepener: 1558.45025947 hartree
electener: -3561.32507582 hartree
oneelecener: -5859.52898086 hartree
twoeener: 2298.20390504 hartree
cpcmener: -0.02179656 hartree
kineticenergy: 1997.85095050 hartree
xcener: -120.680676602748 hartree
chargesum: 0.0000000
charge: -0.177147 -0.189780 -0.453248 0.626646 -0.352518 -0.347129 -0.111629 -0.094533 0.018580 0.027265 -0.099543 -0.262140 -0.245830 -0.261027 0.114356 0.137103 0.135463 0.069381 0.116665 0.111136 0.103320 0.104862 0.111707 0.090309 0.101679 0.110276 0.083935 0.089954 0.089266 0.088335 0.075136 0.090471 0.098677
qa: -0.1771 -0.1898 -0.4532 0.6266 -0.3525 -0.3471 -0.1116 -0.0945 0.0186 0.0273 -0.0995 -0.2621 -0.2458 -0.2610 0.1144 0.1371 0.1355 0.0694 0.1167 0.1111 0.1033 0.1049 0.1117 0.0903 0.1017 0.1103 0.0839 0.0900 0.0893 0.0883 0.0751 0.0905 0.0987
va: 2.2752 2.1619 2.0136 5.4461 2.0730 2.0900 3.8643 3.9577 3.8114 3.8280 3.9265 3.9020 3.9643 3.9220 1.0235 1.0124 1.0082 1.0367 0.9879 1.0168 0.9961 1.0059 1.0032 1.0177 0.9913 1.0106 1.0190 1.0026 1.0060 1.0051 0.9996 1.0150 1.0041
dispcorr: -0.017234610 hartree
energy: -2002.892050961367
dipole: -9.85487 8.78582 -1.06905 -2.25989 2.41100 0.15111 -11.23918 10.47857 -0.76062
magnitude: 1.32070 au
magnitude: 3.35694 debye
