program: Orca
programVersion: 5.0.4
elementType: S S S P O O C C C C C C C C H H H H H H H H H H H H H H H H H H H
charge: 0
multiplicity: 1
keywords: wb97x-d3
keywords: def2-TZVPP
keywords: def2/J RIJCOSX
keywords: DEFGRID2
keywords: scfconv7
keywords: smallprint printgap noloewdin
keywords: NOSOSCF
formula: C8H19O2PS3
InChI: InChI=1/C8H19O2PS3/c1-4-9-11(12,10-5-2)14-8-7-13-6-3/h4-8H2,1-3H3
33 atoms
S  -0.110809 0.802017 1.191564
S  -3.377742 -1.254243 -1.016315
S  3.152131 0.800458 1.046998
P  1.565149 0.423084 0.024432
O  1.437558 -1.04369 -0.60441
O  1.343666 1.217669 -1.347134
C  -1.511404 0.471887 0.049626
C  -1.920211 -0.986963 0.028433
C  2.04581 -2.19318 0.020732
C  1.388325 2.660928 -1.376519
C  -4.70916 -0.70899 0.094681
C  1.39516 -2.584183 1.32434
C  2.709683 3.139731 -1.921159
C  -5.014467 -1.69019 1.208563
H  -1.259178 0.834373 -0.945668
H  -2.315552 1.103059 0.429603
H  -2.115048 -1.357549 1.035527
H  -1.129823 -1.604697 -0.394664
H  1.94329 -2.987826 -0.715794
H  3.110796 -1.999819 0.160805
H  0.562597 2.969199 -2.016277
H  1.201445 3.07183 -0.381489
H  -4.465691 0.277449 0.492554
H  -5.580641 -0.576528 -0.548153
H  1.854417 -3.509326 1.674124
H  1.540687 -1.832583 2.099935
H  0.32667 -2.763662 1.208815
H  3.535578 2.864471 -1.266197
H  2.90125 2.735313 -2.915109
H  2.690652 4.226906 -2.001757
H  -5.316253 -2.658468 0.810548
H  -4.153955 -1.84543 1.859694
H  -5.828883 -1.312325 1.829199
elementType: S P O C H
totalener: -2002.87359983 hartree
nucrepener: 1519.91576883 hartree
electener: -3522.78936866 hartree
oneelecener: -5782.81916997 hartree
twoeener: 2260.02980131 hartree
cpcmener: -0.02233510 hartree
kineticenergy: 1997.85678609 hartree
xcener: -120.682275428168 hartree
chargesum: 0.0000000
charge: -0.170569 -0.185291 -0.458993 0.631751 -0.358277 -0.354880 -0.095145 -0.147298 0.039308 0.046267 -0.094635 -0.259581 -0.238580 -0.255887 0.116762 0.136247 0.112438 0.122801 0.114572 0.101155 0.108688 0.085281 0.095768 0.105881 0.108289 0.079104 0.096042 0.074663 0.089896 0.094950 0.078676 0.086551 0.094046
qa: -0.1706 -0.1853 -0.4590 0.6318 -0.3583 -0.3549 -0.0951 -0.1473 0.0393 0.0463 -0.0946 -0.2596 -0.2386 -0.2559 0.1168 0.1362 0.1124 0.1228 0.1146 0.1012 0.1087 0.0853 0.0958 0.1059 0.1083 0.0791 0.0960 0.0747 0.0899 0.0950 0.0787 0.0866 0.0940
va: 2.2863 2.1655 2.0013 5.4500 2.0770 2.0804 3.8412 3.9741 3.8126 3.8422 3.9416 3.9031 3.9511 3.9205 1.0335 1.0073 1.0062 1.0188 0.9934 1.0155 0.9909 1.0096 1.0090 1.0016 1.0114 1.0192 0.9992 1.0199 1.0042 1.0072 1.0126 1.0013 1.0046
dispcorr: -0.015454999 hartree
energy: -2002.889054830606
dipole: -13.20390 11.50901 -1.69489 -4.47753 4.47158 -0.00595 0.16393 -0.18806 -0.02413
magnitude: 1.69507 au
magnitude: 4.30853 debye
