program: Orca
programVersion: 5.0.4
elementType: S S S P O O C C C C C C C C H H H H H H H H H H H H H H H H H H H
charge: 0
multiplicity: 1
keywords: wb97x-d3
keywords: def2-TZVPP
keywords: def2/J RIJCOSX
keywords: DEFGRID2
keywords: scfconv7
keywords: smallprint printgap noloewdin
keywords: NOSOSCF
formula: C8H19O2PS3
InChI: InChI=1/C8H19O2PS3/c1-4-9-11(12,10-5-2)14-8-7-13-6-3/h4-8H2,1-3H3
33 atoms
S  0.240127 -0.583643 -1.760086
S  -3.731542 -0.9081 0.204241
S  0.350297 1.499535 0.962123
P  1.323378 0.366163 -0.263258
O  2.126179 -0.846012 0.394459
O  2.473822 1.081332 -1.117764
C  -1.176896 -1.240556 -0.795108
C  -2.354217 -0.287798 -0.796228
C  2.720106 -0.758361 1.709144
C  2.211287 2.260495 -1.904477
C  -3.039247 -0.722333 1.8774
C  1.873683 -1.490805 2.717554
C  3.475399 3.074385 -1.990323
C  -4.151425 -0.787846 2.906476
H  -0.831199 -1.472662 0.212113
H  -1.437484 -2.18559 -1.271462
H  -2.742622 -0.166074 -1.808651
H  -2.060695 0.698085 -0.434515
H  3.705884 -1.213201 1.614557
H  2.862362 0.284192 1.999456
H  1.879765 1.946968 -2.896543
H  1.407416 2.843716 -1.448684
H  -2.303889 -1.505605 2.06719
H  -2.522304 0.237165 1.933356
H  0.896642 -1.021655 2.834869
H  1.729725 -2.534256 2.435213
H  2.372204 -1.473867 3.687619
H  4.291885 2.503854 -2.433965
H  3.295983 3.944368 -2.622645
H  3.788914 3.43105 -1.009249
H  -3.731599 -0.710659 3.910331
H  -4.863445 0.027482 2.777288
H  -4.700937 -1.728766 2.853131
elementType: S P O C H
totalener: -2002.88398420 hartree
nucrepener: 1520.17459719 hartree
electener: -3523.05858139 hartree
oneelecener: -5783.58780620 hartree
twoeener: 2260.52922481 hartree
cpcmener: -0.01593353 hartree
kineticenergy: 1997.84667475 hartree
xcener: -120.677167980439 hartree
chargesum: 0.0000000
charge: -0.177734 -0.174499 -0.464293 0.661118 -0.345580 -0.353005 -0.066656 -0.139240 0.051164 0.032474 -0.105457 -0.238710 -0.238045 -0.256630 0.102711 0.128313 0.124345 0.103565 0.106387 0.085837 0.101735 0.090451 0.090274 0.090506 0.072140 0.090272 0.098020 0.088819 0.087547 0.085661 0.092984 0.087281 0.088247
qa: -0.1777 -0.1745 -0.4643 0.6611 -0.3456 -0.3530 -0.0667 -0.1392 0.0512 0.0325 -0.1055 -0.2387 -0.2380 -0.2566 0.1027 0.1283 0.1243 0.1036 0.1064 0.0858 0.1017 0.0905 0.0903 0.0905 0.0721 0.0903 0.0980 0.0888 0.0875 0.0857 0.0930 0.0873 0.0882
va: 2.2814 2.1876 1.9662 5.4165 2.0965 2.1071 3.8413 3.9647 3.8445 3.8505 3.9867 3.9183 3.9620 3.9434 1.0291 1.0179 1.0089 1.0388 0.9962 1.0147 0.9930 1.0071 0.9994 1.0074 1.0164 1.0035 1.0100 1.0038 1.0067 1.0075 1.0025 1.0101 1.0040
dispcorr: -0.014662473 hartree
energy: -2002.898646673096
dipole: -0.64292 1.66519 1.02228 0.36560 -0.47442 -0.10882 10.73856 -10.53194 0.20662
magnitude: 1.04861 au
magnitude: 2.66536 debye
