program: Orca
programVersion: 5.0.4
elementType: S S S P O O C C C C C C C C H H H H H H H H H H H H H H H H H H H
charge: 0
multiplicity: 1
keywords: wb97x-d3
keywords: def2-TZVPP
keywords: def2/J RIJCOSX
keywords: DEFGRID2
keywords: scfconv7
keywords: smallprint printgap noloewdin
keywords: NOSOSCF
formula: C8H19O2PS3
InChI: InChI=1/C8H19O2PS3/c1-4-9-11(12,10-5-2)14-8-7-13-6-3/h4-8H2,1-3H3
33 atoms
S  0.177441 -1.788612 -0.803689
S  -3.915609 -0.036619 -0.769344
S  0.460321 0.47113 1.753201
P  1.212801 -0.235978 0.121095
O  2.614113 -0.996936 0.224765
O  1.533497 0.853376 -1.008421
C  -1.553896 -1.432441 -0.338527
C  -2.128025 -0.215405 -1.03725
C  3.768421 -0.332071 0.781753
C  0.914471 2.142229 -1.14024
C  -3.995724 1.040158 0.692582
C  4.778275 -1.382113 1.162374
C  1.985457 3.199527 -1.222236
C  -3.619837 0.383593 2.0054
H  -1.613437 -1.357741 0.745874
H  -2.089043 -2.334722 -0.637601
H  -1.979482 -0.296871 -2.114912
H  -1.640818 0.704831 -0.710917
H  4.17604 0.356048 0.038665
H  3.470395 0.250532 1.656899
H  0.308515 2.120907 -2.047442
H  0.250712 2.333125 -0.294332
H  -3.383526 1.924691 0.505806
H  -5.032986 1.379288 0.722978
H  5.656278 -0.895091 1.586868
H  4.380885 -2.065658 1.912643
H  5.104039 -1.96169 0.298719
H  1.518893 4.17472 -1.366918
H  2.57211 3.2418 -0.303803
H  2.660879 3.026014 -2.06052
H  -4.220131 -0.506951 2.191597
H  -2.56794 0.100745 2.031529
H  -3.786587 1.080185 2.830195
elementType: S P O C H
totalener: -2002.88376998 hartree
nucrepener: 1526.16942791 hartree
electener: -3529.05319789 hartree
oneelecener: -5795.40693681 hartree
twoeener: 2266.35373893 hartree
cpcmener: -0.01709852 hartree
kineticenergy: 1997.84865833 hartree
xcener: -120.677548687879 hartree
chargesum: -0.0000000
charge: -0.170433 -0.178533 -0.459967 0.643405 -0.345011 -0.337833 -0.110636 -0.112441 0.029656 0.056543 -0.102380 -0.239650 -0.246630 -0.248655 0.119747 0.129865 0.125152 0.082450 0.104162 0.091449 0.102603 0.086824 0.092765 0.108686 0.086373 0.087036 0.089017 0.093174 0.082813 0.090793 0.083735 0.068720 0.097201
qa: -0.1704 -0.1785 -0.4600 0.6434 -0.3450 -0.3378 -0.1106 -0.1124 0.0297 0.0565 -0.1024 -0.2396 -0.2466 -0.2487 0.1197 0.1299 0.1252 0.0824 0.1042 0.0914 0.1026 0.0868 0.0928 0.1087 0.0864 0.0870 0.0890 0.0932 0.0828 0.0908 0.0837 0.0687 0.0972
va: 2.3021 2.1781 1.9751 5.4171 2.1263 2.0762 3.8809 3.9253 3.8576 3.8153 3.9566 3.9620 3.9513 3.8935 1.0304 1.0159 1.0157 1.0362 0.9942 1.0028 0.9885 1.0122 1.0099 1.0007 1.0067 1.0059 1.0034 1.0088 1.0075 1.0040 1.0155 1.0178 1.0064
dispcorr: -0.015590198 hartree
energy: -2002.899360175341
dipole: 2.35026 -1.64886 0.70140 10.87273 -9.63901 1.23373 3.76059 -4.03420 -0.27361
magnitude: 1.44530 au
magnitude: 3.67367 debye
