program: Orca
programVersion: 5.0.4
elementType: S S S P O O C C C C C C C C H H H H H H H H H H H H H H H H H H H
charge: 0
multiplicity: 1
keywords: wb97x-d3
keywords: def2-TZVPP
keywords: def2/J RIJCOSX
keywords: DEFGRID2
keywords: scfconv7
keywords: smallprint printgap noloewdin
keywords: NOSOSCF
formula: C8H19O2PS3
InChI: InChI=1/C8H19O2PS3/c1-4-9-11(12,10-5-2)14-8-7-13-6-3/h4-8H2,1-3H3
33 atoms
S  0.237676 -0.567542 1.756374
S  -3.771215 -0.548904 -0.175974
S  3.207781 0.611294 1.077489
P  1.489697 0.23284 0.299269
O  1.431951 -0.730972 -0.973871
O  0.715328 1.45949 -0.383789
C  -1.247528 -1.088915 0.814132
C  -2.289716 0.003753 0.710094
C  2.381281 -1.790804 -1.198602
C  0.49892 2.676489 0.353496
C  -3.133743 -0.821695 -1.857419
C  2.215875 -2.953115 -0.251582
C  -0.367996 3.583615 -0.478941
C  -2.461323 0.382984 -2.482733
H  -1.641572 -1.943046 1.366105
H  -0.930966 -1.455452 -0.161017
H  -1.887775 0.900236 0.239303
H  -2.63782 0.29343 1.702778
H  2.198661 -2.102071 -2.226133
H  3.39318 -1.384432 -1.14677
H  0.017591 2.451332 1.309402
H  1.464014 3.142275 0.564507
H  -2.469548 -1.687348 -1.86748
H  -4.01718 -1.105116 -2.432843
H  2.483575 -2.693465 0.772428
H  1.19692 -3.341277 -0.259237
H  2.8798 -3.757464 -0.571414
H  -1.35024 3.147241 -0.663833
H  -0.515707 4.522481 0.055274
H  0.097328 3.814906 -1.43736
H  -1.526259 0.635944 -1.983751
H  -2.218439 0.17111 -3.525783
H  -3.109735 1.2590 -2.460001
elementType: S P O C H
totalener: -2002.88673923 hartree
nucrepener: 1556.87055688 hartree
electener: -3559.75729611 hartree
oneelecener: -5856.31101911 hartree
twoeener: 2296.55372300 hartree
cpcmener: -0.01865078 hartree
kineticenergy: 1997.84079455 hartree
xcener: -120.679764151575 hartree
chargesum: -0.0000000
charge: -0.168812 -0.180923 -0.445339 0.615896 -0.343401 -0.333038 -0.093386 -0.107377 0.038563 -0.008628 -0.120634 -0.255075 -0.241540 -0.236185 0.127855 0.111194 0.076491 0.128447 0.109556 0.095644 0.109976 0.117883 0.093918 0.113474 0.081817 0.092586 0.105401 0.084500 0.095588 0.092424 0.058659 0.100357 0.084107
qa: -0.1688 -0.1809 -0.4453 0.6159 -0.3434 -0.3330 -0.0934 -0.1074 0.0386 -0.0086 -0.1206 -0.2551 -0.2415 -0.2362 0.1279 0.1112 0.0765 0.1284 0.1096 0.0956 0.1100 0.1179 0.0939 0.1135 0.0818 0.0926 0.1054 0.0845 0.0956 0.0924 0.0587 0.1004 0.0841
va: 2.2859 2.1824 2.0249 5.4501 2.0932 2.0859 3.8641 3.9793 3.8370 3.8378 3.9661 3.9033 3.9467 3.8951 1.0191 1.0266 1.0316 1.0081 0.9916 1.0130 0.9957 1.0087 1.0036 0.9994 1.0153 1.0019 1.0116 1.0022 1.0076 1.0034 1.0147 1.0070 1.0146
dispcorr: -0.017310694 hartree
energy: -2002.904049918876
dipole: -9.85731 8.97725 -0.88006 0.41947 -0.85910 -0.43963 -12.74539 11.62061 -1.12478
magnitude: 1.49430 au
magnitude: 3.79820 debye
