program: Orca
programVersion: 5.0.4
elementType: S S S P O O C C C C C C C C H H H H H H H H H H H H H H H H H H H
charge: 0
multiplicity: 1
keywords: wb97x-d3
keywords: def2-TZVPP
keywords: def2/J RIJCOSX
keywords: DEFGRID2
keywords: scfconv7
keywords: smallprint printgap noloewdin
keywords: NOSOSCF
formula: C8H19O2PS3
InChI: InChI=1/C8H19O2PS3/c1-4-9-11(12,10-5-2)14-8-7-13-6-3/h4-8H2,1-3H3
33 atoms
S  -0.082423 -1.595065 1.519675
S  -3.578623 -0.829872 -1.137276
S  2.688638 0.183415 1.809968
P  1.077983 -0.032821 0.777234
O  1.299294 -0.290377 -0.791434
O  0.049729 1.185233 0.720553
C  -1.767677 -1.22356 0.897247
C  -1.943382 -1.401151 -0.597724
C  2.198209 -1.31485 -1.256336
C  0.474908 2.563613 0.778883
C  -3.316547 0.971492 -1.133487
C  3.478783 -0.708406 -1.773932
C  1.100958 3.035326 -0.509873
C  -2.453198 1.475738 -2.272622
H  -2.036436 -0.224325 1.232851
H  -2.403075 -1.924671 1.440202
H  -1.871914 -2.455453 -0.867653
H  -1.179781 -0.877184 -1.169317
H  2.406049 -2.03892 -0.463861
H  1.666258 -1.844304 -2.04684
H  -0.434418 3.12125 0.997344
H  1.158574 2.694621 1.620223
H  -4.317169 1.403361 -1.193534
H  -2.908668 1.275853 -0.167805
H  4.039674 -0.220701 -0.976918
H  4.105753 -1.496296 -2.193495
H  3.286349 0.019781 -2.562676
H  1.274359 4.110175 -0.442036
H  2.063838 2.560834 -0.700831
H  0.446926 2.857848 -1.364088
H  -1.449454 1.050219 -2.247488
H  -2.896574 1.237798 -3.23963
H  -2.348677 2.561019 -2.210078
elementType: S P O C H
totalener: -2002.88391055 hartree
nucrepener: 1563.34488172 hartree
electener: -3566.22879227 hartree
oneelecener: -5869.47605361 hartree
twoeener: 2303.24726134 hartree
cpcmener: -0.01748040 hartree
kineticenergy: 1997.83815021 hartree
xcener: -120.677276433691 hartree
chargesum: -0.0000000
charge: -0.175393 -0.177663 -0.450831 0.623484 -0.332487 -0.342212 -0.101658 -0.146127 0.054277 0.013436 -0.094490 -0.241457 -0.234630 -0.268245 0.116323 0.137999 0.128980 0.101421 0.081029 0.101323 0.106792 0.104014 0.112609 0.089035 0.077952 0.096748 0.089022 0.102283 0.077922 0.088537 0.073388 0.091539 0.097082
qa: -0.1754 -0.1777 -0.4508 0.6235 -0.3325 -0.3422 -0.1017 -0.1461 0.0543 0.0134 -0.0945 -0.2415 -0.2346 -0.2682 0.1163 0.1380 0.1290 0.1014 0.0810 0.1013 0.1068 0.1040 0.1126 0.0890 0.0780 0.0967 0.0890 0.1023 0.0779 0.0885 0.0734 0.0915 0.0971
va: 2.2878 2.1681 2.0111 5.4109 2.0418 2.0925 3.8755 3.9651 3.8474 3.8532 3.9246 3.9357 3.9037 3.9216 1.0218 1.0061 1.0114 1.0224 1.0117 0.9941 0.9910 1.0130 1.0019 1.0151 1.0197 1.0097 1.0033 1.0103 1.0158 1.0017 1.0057 1.0158 1.0018
dispcorr: -0.017409010 hartree
energy: -2002.901319561584
dipole: -1.95811 1.40237 -0.55574 11.54742 -10.70716 0.84026 -16.66378 15.38277 -1.28101
magnitude: 1.62968 au
magnitude: 4.14233 debye
