program: Orca
programVersion: 5.0.4
elementType: S S S P O O C C C C C C C C H H H H H H H H H H H H H H H H H H H
charge: 0
multiplicity: 1
keywords: wb97x-d3
keywords: def2-TZVPP
keywords: def2/J RIJCOSX
keywords: DEFGRID2
keywords: scfconv7
keywords: smallprint printgap noloewdin
keywords: NOSOSCF
formula: C8H19O2PS3
InChI: InChI=1/C8H19O2PS3/c1-4-9-11(12,10-5-2)14-8-7-13-6-3/h4-8H2,1-3H3
33 atoms
S  0.210677 0.145632 1.870722
S  -3.817801 -0.483137 0.044475
S  3.206624 0.6078 0.657721
P  1.363445 0.37247 0.151022
O  0.996997 -0.828128 -0.835954
O  0.693384 1.528439 -0.727744
C  -1.358972 -0.605706 1.294577
C  -2.215679 0.284834 0.420127
C  1.763197 -2.045485 -0.903702
C  0.70917 2.901286 -0.298026
C  -3.332512 -1.900238 -0.989396
C  1.560481 -2.940361 0.293816
C  1.76654 3.680686 -1.04045
C  -2.614734 -1.532623 -2.272261
H  -1.88133 -0.836261 2.224705
H  -1.125914 -1.553284 0.812567
H  -1.714644 0.552292 -0.508449
H  -2.453046 1.215856 0.937427
H  1.418416 -2.533963 -1.813943
H  2.818852 -1.799641 -1.034439
H  -0.286326 3.290671 -0.510711
H  0.859726 2.969793 0.78263
H  -2.743359 -2.604348 -0.399822
H  -4.276039 -2.402508 -1.21222
H  0.506882 -3.172891 0.451459
H  2.083815 -3.881363 0.119123
H  1.964207 -2.503954 1.207483
H  2.768595 3.32843 -0.797511
H  1.626103 3.615318 -2.119922
H  1.701167 4.732365 -0.759002
H  -2.42103 -2.432601 -2.859369
H  -3.211358 -0.854357 -2.882195
H  -1.650635 -1.060506 -2.083212
elementType: S P O C H
totalener: -2002.88417318 hartree
nucrepener: 1554.86148708 hartree
electener: -3557.74566027 hartree
oneelecener: -5852.41361669 hartree
twoeener: 2294.66795642 hartree
cpcmener: -0.01866864 hartree
kineticenergy: 1997.84058809 hartree
xcener: -120.680439595192 hartree
chargesum: -0.0000000
charge: -0.172056 -0.176337 -0.447503 0.611500 -0.335698 -0.339002 -0.074350 -0.157955 0.036115 0.046903 -0.112710 -0.259710 -0.235804 -0.249510 0.128433 0.104818 0.107955 0.126287 0.107492 0.100047 0.103123 0.082671 0.092789 0.114006 0.093902 0.107131 0.084345 0.076390 0.088212 0.092689 0.097067 0.085069 0.073690
qa: -0.1721 -0.1763 -0.4475 0.6115 -0.3357 -0.3390 -0.0744 -0.1580 0.0361 0.0469 -0.1127 -0.2597 -0.2358 -0.2495 0.1284 0.1048 0.1080 0.1263 0.1075 0.1000 0.1031 0.0827 0.0928 0.1140 0.0939 0.1071 0.0843 0.0764 0.0882 0.0927 0.0971 0.0851 0.0737
va: 2.2840 2.1792 2.0170 5.4536 2.1021 2.0838 3.8679 3.9788 3.8285 3.8511 3.9512 3.8995 3.9497 3.9030 1.0184 1.0228 1.0195 1.0117 0.9914 1.0154 0.9910 1.0104 1.0064 0.9996 0.9982 1.0121 1.0163 1.0205 1.0044 1.0077 1.0045 1.0160 1.0101
dispcorr: -0.017036292 hartree
energy: -2002.901209474576
dipole: -7.17375 6.23152 -0.94222 -5.86462 5.02317 -0.84146 -10.62482 9.89531 -0.72950
magnitude: 1.45877 au
magnitude: 3.70790 debye
