program: Orca
programVersion: 5.0.4
elementType: S S S P O O C C C C C C C C H H H H H H H H H H H H H H H H H H H
charge: 0
multiplicity: 1
keywords: wb97x-d3
keywords: def2-TZVPP
keywords: def2/J RIJCOSX
keywords: DEFGRID2
keywords: scfconv7
keywords: smallprint printgap noloewdin
keywords: NOSOSCF
formula: C8H19O2PS3
InChI: InChI=1/C8H19O2PS3/c1-4-9-11(12,10-5-2)14-8-7-13-6-3/h4-8H2,1-3H3
33 atoms
S  -0.501708 0.323577 -1.588839
S  -3.328464 -0.809435 1.650048
S  1.016721 1.692253 1.140039
P  1.184179 0.526792 -0.38898
O  1.570887 -0.992334 -0.083926
O  2.296071 0.91388 -1.474663
C  -1.841821 0.390318 -0.345233
C  -1.881164 -0.826625 0.557666
C  2.614555 -1.351423 0.846287
C  2.474976 2.276375 -1.912242
C  -4.62936 -1.39593 0.523784
C  2.226628 -2.639753 1.522884
C  3.670882 2.9003 -1.240321
C  -4.543969 -2.874684 0.204067
H  -2.747899 0.46935 -0.948001
H  -1.73985 1.311626 0.227331
H  -1.014747 -0.841397 1.219899
H  -1.859921 -1.751452 -0.019827
H  3.544922 -1.460546 0.28681
H  2.752822 -0.556127 1.58211
H  2.611512 2.225916 -2.991916
H  1.573285 2.863189 -1.723435
H  -5.567388 -1.169254 1.033851
H  -4.62013 -0.79345 -0.386495
H  2.069826 -3.442849 0.802121
H  3.02707 -2.9485 2.195764
H  1.318823 -2.520247 2.114943
H  3.81462 3.910346 -1.628352
H  3.530899 2.970847 -0.161344
H  4.580916 2.333577 -1.439831
H  -3.616198 -3.128771 -0.309782
H  -4.605104 -3.479645 1.108576
H  -5.367412 -3.165846 -0.451331
elementType: S P O C H
totalener: -2002.88574534 hartree
nucrepener: 1510.00163835 hartree
electener: -3512.88738369 hartree
oneelecener: -5763.42668485 hartree
twoeener: 2250.53930116 hartree
cpcmener: -0.01719944 hartree
kineticenergy: 1997.85270278 hartree
xcener: -120.677952897304 hartree
chargesum: 0.0000000
charge: -0.164804 -0.171513 -0.456528 0.645645 -0.338505 -0.363756 -0.108975 -0.121381 0.037697 0.046578 -0.100741 -0.237513 -0.240905 -0.253106 0.132580 0.116542 0.097918 0.112758 0.106603 0.086763 0.108019 0.083462 0.105902 0.092339 0.089270 0.090632 0.085699 0.093200 0.077545 0.088983 0.086313 0.080194 0.093085
qa: -0.1648 -0.1715 -0.4565 0.6456 -0.3385 -0.3638 -0.1090 -0.1214 0.0377 0.0466 -0.1007 -0.2375 -0.2409 -0.2531 0.1326 0.1165 0.0979 0.1128 0.1066 0.0868 0.1080 0.0835 0.1059 0.0923 0.0893 0.0906 0.0857 0.0932 0.0775 0.0890 0.0863 0.0802 0.0931
va: 2.3053 2.1720 1.9824 5.4212 2.0899 2.0877 3.8620 3.9356 3.8425 3.8512 3.9522 3.9430 3.9384 3.9160 1.0066 1.0392 1.0305 1.0158 0.9960 1.0131 0.9941 1.0121 1.0013 1.0080 1.0042 1.0086 1.0043 1.0085 1.0196 1.0037 1.0017 1.0126 1.0047
dispcorr: -0.014423885 hartree
energy: -2002.900169222093
dipole: -2.04991 2.21264 0.16273 -9.24795 8.67411 -0.57384 0.52769 -1.62855 -1.10087
magnitude: 1.25207 au
magnitude: 3.18251 debye
