program: Orca
programVersion: 5.0.4
elementType: S S S P O O C C C C C C C C H H H H H H H H H H H H H H H H H H H
charge: 0
multiplicity: 1
keywords: wb97x-d3
keywords: def2-TZVPP
keywords: def2/J RIJCOSX
keywords: DEFGRID2
keywords: scfconv7
keywords: smallprint printgap noloewdin
keywords: NOSOSCF
formula: C8H19O2PS3
InChI: InChI=1/C8H19O2PS3/c1-4-9-11(12,10-5-2)14-8-7-13-6-3/h4-8H2,1-3H3
33 atoms
S  -0.101185 -0.300862 1.490809
S  -3.571633 -0.446254 -1.285207
S  2.961301 0.91681 1.409099
P  1.496004 0.30356 0.318977
O  1.834021 -0.888092 -0.702551
O  0.817906 1.352931 -0.67722
C  -1.337714 -0.901998 0.270743
C  -2.31413 0.182632 -0.139558
C  2.850581 -1.875476 -0.452405
C  1.601597 2.046606 -1.676235
C  -4.733649 -1.243184 -0.135613
C  2.448825 -2.885603 0.593873
C  1.759082 3.496792 -1.298487
C  -5.627962 -0.268389 0.603971
H  -1.846272 -1.719848 0.782654
H  -0.822127 -1.330721 -0.587227
H  -1.798483 0.986004 -0.664079
H  -2.798863 0.62776 0.730464
H  3.00675 -2.358832 -1.415974
H  3.779734 -1.373983 -0.174409
H  2.57614 1.571796 -1.808661
H  1.054766 1.938256 -2.612308
H  -5.331904 -1.915942 -0.752842
H  -4.1776 -1.876205 0.558368
H  3.208874 -3.667281 0.634163
H  2.378539 -2.444151 1.587879
H  1.497027 -3.360132 0.353555
H  2.351073 3.611016 -0.390531
H  2.272122 4.023651 -2.104207
H  0.792208 3.978288 -1.148868
H  -6.306954 -0.808292 1.267307
H  -5.054463 0.424992 1.220259
H  -6.232107 0.317153 -0.088857
elementType: S P O C H
totalener: -2002.88555468 hartree
nucrepener: 1505.00264849 hartree
electener: -3507.88820317 hartree
oneelecener: -5753.17906044 hartree
twoeener: 2245.29085726 hartree
cpcmener: -0.01861885 hartree
kineticenergy: 1997.83184757 hartree
xcener: -120.674500287886 hartree
chargesum: 0.0000000
charge: -0.164022 -0.179213 -0.455293 0.639275 -0.348381 -0.347368 -0.113246 -0.130544 0.042684 0.034869 -0.096215 -0.249211 -0.232663 -0.252725 0.134060 0.112036 0.121323 0.107725 0.107374 0.091685 0.091473 0.103969 0.103985 0.093702 0.102369 0.077315 0.092544 0.075437 0.092063 0.088464 0.092348 0.084442 0.079740
qa: -0.1640 -0.1792 -0.4553 0.6393 -0.3484 -0.3474 -0.1132 -0.1305 0.0427 0.0349 -0.0962 -0.2492 -0.2327 -0.2527 0.1341 0.1120 0.1213 0.1077 0.1074 0.0917 0.0915 0.1040 0.1040 0.0937 0.1024 0.0773 0.0925 0.0754 0.0921 0.0885 0.0923 0.0844 0.0797
va: 2.2835 2.1628 2.0028 5.4194 2.0589 2.0887 3.8609 3.9660 3.8400 3.8710 3.9439 3.9100 3.9373 3.9226 1.0075 1.0404 1.0228 1.0129 0.9914 1.0155 1.0040 0.9947 1.0025 1.0083 1.0120 1.0172 1.0031 1.0179 1.0083 1.0035 1.0052 1.0026 1.0120
dispcorr: -0.014752073 hartree
energy: -2002.900306753046
dipole: -11.41231 10.62549 -0.78681 -3.52782 2.44631 -1.08151 -5.17796 4.21458 -0.96338
magnitude: 1.64828 au
magnitude: 4.18961 debye
