program: Orca
programVersion: 5.0.4
elementType: S S S P O O C C C C C C C C H H H H H H H H H H H H H H H H H H H
charge: 0
multiplicity: 1
keywords: wb97x-d3
keywords: def2-TZVPP
keywords: def2/J RIJCOSX
keywords: DEFGRID2
keywords: scfconv7
keywords: smallprint printgap noloewdin
keywords: NOSOSCF
formula: C8H19O2PS3
InChI: InChI=1/C8H19O2PS3/c1-4-9-11(12,10-5-2)14-8-7-13-6-3/h4-8H2,1-3H3
33 atoms
S  0.157644 0.027722 1.880722
S  -3.711503 -1.149704 -0.003966
S  3.158538 0.67772 0.747439
P  1.35119 0.306022 0.197245
O  1.114154 -0.946813 -0.768267
O  0.619532 1.377132 -0.733634
C  -1.551203 0.074607 1.215951
C  -2.008052 -1.237999 0.613522
C  1.605672 -2.257042 -0.42952
C  0.912584 2.785654 -0.6875
C  -3.552093 0.017946 -1.390413
C  2.853284 -2.576422 -1.215602
C  0.408965 3.461752 0.564488
C  -2.560299 -0.395497 -2.458989
H  -1.622171 0.901687 0.51179
H  -2.167238 0.333487 2.07816
H  -2.013113 -2.022716 1.371644
H  -1.346882 -1.570678 -0.184514
H  1.788451 -2.338922 0.645099
H  0.800275 -2.94919 -0.67419
H  1.988065 2.932793 -0.804394
H  0.421552 3.193447 -1.569829
H  -4.559303 0.070958 -1.808683
H  -3.3243 1.015839 -1.012193
H  2.680094 -2.494249 -2.289072
H  3.678116 -1.918602 -0.943504
H  3.156708 -3.602652 -1.004846
H  0.571202 4.536167 0.467816
H  -0.659111 3.299521 0.71296
H  0.940839 3.128942 1.455603
H  -1.533544 -0.388452 -2.0929
H  -2.778375 -1.392618 -2.841672
H  -2.605998 0.30427 -3.295745
elementType: S P O C H
totalener: -2002.88499957 hartree
nucrepener: 1557.93365717 hartree
electener: -3560.81865674 hartree
oneelecener: -5858.54659069 hartree
twoeener: 2297.72793396 hartree
cpcmener: -0.01837611 hartree
kineticenergy: 1997.84026758 hartree
xcener: -120.680611573047 hartree
chargesum: -0.0000000
charge: -0.169147 -0.179055 -0.444703 0.609690 -0.336231 -0.339817 -0.080711 -0.137819 0.047432 0.039573 -0.117102 -0.237030 -0.256736 -0.243374 0.104930 0.128724 0.128448 0.096763 0.084941 0.100909 0.096553 0.108100 0.113976 0.092693 0.088347 0.076850 0.092946 0.105658 0.092444 0.082476 0.066923 0.084427 0.098919
qa: -0.1691 -0.1791 -0.4447 0.6097 -0.3362 -0.3398 -0.0807 -0.1378 0.0474 0.0396 -0.1171 -0.2370 -0.2567 -0.2434 0.1049 0.1287 0.1284 0.0968 0.0849 0.1009 0.0966 0.1081 0.1140 0.0927 0.0883 0.0768 0.0929 0.1057 0.0924 0.0825 0.0669 0.0844 0.0989
va: 2.2813 2.1814 2.0202 5.4563 2.0823 2.0966 3.8629 3.9906 3.8454 3.8343 3.9604 3.9583 3.9033 3.8987 1.0271 1.0178 1.0085 1.0204 1.0090 0.9900 1.0139 0.9917 0.9994 1.0048 1.0045 1.0199 1.0073 1.0121 1.0002 1.0158 1.0134 1.0158 1.0049
dispcorr: -0.017076744 hartree
energy: -2002.902076311478
dipole: -7.56561 6.48724 -1.07837 0.61960 -0.32402 0.29558 -11.43032 10.59329 -0.83703
magnitude: 1.39674 au
magnitude: 3.55023 debye
