program: Orca
programVersion: 5.0.4
elementType: S S S P O O C C C C C C C C H H H H H H H H H H H H H H H H H H H
charge: 0
multiplicity: 1
keywords: wb97x-d3
keywords: def2-TZVPP
keywords: def2/J RIJCOSX
keywords: DEFGRID2
keywords: scfconv7
keywords: smallprint printgap noloewdin
keywords: NOSOSCF
formula: C8H19O2PS3
InChI: InChI=1/C8H19O2PS3/c1-4-9-11(12,10-5-2)14-8-7-13-6-3/h4-8H2,1-3H3
33 atoms
S  -0.363427 0.118279 -1.640273
S  -3.434641 -0.767205 1.450609
S  1.044002 1.369311 1.197442
P  1.257937 0.223116 -0.339489
O  1.577975 -1.312534 -0.03658
O  2.435182 0.582452 -1.365024
C  -1.768866 0.292414 -0.48482
C  -1.959367 -0.917412 0.408111
C  2.40706 -1.717834 1.071986
C  2.648983 1.939743 -1.802243
C  -4.747508 -1.097996 0.234851
C  3.856612 -1.330886 0.904797
C  3.802507 2.568041 -1.060931
C  -6.087848 -1.17697 0.940958
H  -2.626874 0.442335 -1.141306
H  -1.630207 1.202428 0.097941
H  -1.119882 -1.02174 1.097094
H  -2.019347 -1.83683 -0.176744
H  1.996361 -1.306622 1.99659
H  2.298444 -2.800688 1.110782
H  2.85411 1.877987 -2.870487
H  1.738753 2.531757 -1.678825
H  -4.764254 -0.309055 -0.518161
H  -4.526023 -2.039358 -0.271433
H  4.004873 -0.252167 0.950686
H  4.431612 -1.771687 1.719807
H  4.268839 -1.702339 -0.033295
H  3.981558 3.56787 -1.457806
H  3.588891 2.663614 0.003186
H  4.719298 1.990872 -1.184889
H  -6.104726 -1.977522 1.680946
H  -6.33301 -0.24235 1.446718
H  -6.877968 -1.376611 0.216257
elementType: S P O C H
totalener: -2002.88519457 hartree
nucrepener: 1508.04805564 hartree
electener: -3510.93325021 hartree
oneelecener: -5759.58432830 hartree
twoeener: 2248.65107809 hartree
cpcmener: -0.01696772 hartree
kineticenergy: 1997.85536537 hartree
xcener: -120.679982732671 hartree
chargesum: 0.0000000
charge: -0.167482 -0.165059 -0.453403 0.640973 -0.346862 -0.360501 -0.105424 -0.119172 0.037657 0.047338 -0.120445 -0.237800 -0.251344 -0.252289 0.135225 0.114429 0.106863 0.108416 0.091655 0.109830 0.108427 0.084562 0.093787 0.096694 0.073763 0.098734 0.091713 0.099426 0.079997 0.090723 0.087871 0.088075 0.093624
qa: -0.1675 -0.1651 -0.4534 0.6410 -0.3469 -0.3605 -0.1054 -0.1192 0.0377 0.0473 -0.1204 -0.2378 -0.2513 -0.2523 0.1352 0.1144 0.1069 0.1084 0.0917 0.1098 0.1084 0.0846 0.0938 0.0967 0.0738 0.0987 0.0917 0.0994 0.0800 0.0907 0.0879 0.0881 0.0936
va: 2.3091 2.1964 1.9826 5.4146 2.0857 2.0835 3.8462 3.9536 3.8529 3.8519 4.0092 3.9102 3.9278 3.9184 1.0050 1.0432 1.0254 1.0212 1.0119 0.9906 0.9942 1.0125 0.9988 0.9987 1.0138 1.0101 1.0064 1.0102 1.0175 1.0022 1.0089 1.0062 1.0024
dispcorr: -0.014550779 hartree
energy: -2002.899745351445
dipole: -2.39141 2.53553 0.14412 -2.36157 1.95958 -0.40199 0.99992 -2.06240 -1.06248
magnitude: 1.14509 au
magnitude: 2.91059 debye
