program: Orca
programVersion: 5.0.4
elementType: S S S P O O C C C C C C C C H H H H H H H H H H H H H H H H H H H
charge: 0
multiplicity: 1
keywords: wb97x-d3
keywords: def2-TZVPP
keywords: def2/J RIJCOSX
keywords: DEFGRID2
keywords: scfconv7
keywords: smallprint printgap noloewdin
keywords: NOSOSCF
formula: C8H19O2PS3
InChI: InChI=1/C8H19O2PS3/c1-4-9-11(12,10-5-2)14-8-7-13-6-3/h4-8H2,1-3H3
33 atoms
S  -0.032584 -1.370385 -0.826051
S  -3.766753 0.531088 0.661624
S  1.182279 0.579625 1.704966
P  1.326161 0.050566 -0.143651
O  2.705086 -0.626112 -0.601481
O  1.189985 1.219237 -1.225291
C  -1.518284 -1.000489 0.172263
C  -2.210191 0.285057 -0.235576
C  3.291784 -1.710649 0.147081
C  1.717398 2.543298 -0.999586
C  -4.860263 -0.610204 -0.23886
C  4.450438 -1.224319 0.980077
C  3.226133 2.591873 -1.009615
C  -6.267519 -0.510603 0.320301
H  -1.235993 -0.989221 1.224583
H  -2.160016 -1.867086 0.00785
H  -2.400496 0.309424 -1.309892
H  -1.586898 1.14781 0.004472
H  2.540705 -2.199263 0.773352
H  3.619262 -2.439153 -0.594811
H  1.306289 3.140967 -1.811772
H  1.318666 2.934489 -0.06125
H  -4.851075 -0.346878 -1.298144
H  -4.491136 -1.632553 -0.146049
H  5.211128 -0.742983 0.364567
H  4.124102 -0.521849 1.746603
H  4.914309 -2.076145 1.479255
H  3.6636 2.075413 -0.154685
H  3.637758 2.166276 -1.924974
H  3.541497 3.634819 -0.955991
H  -6.929972 -1.185809 -0.222613
H  -6.304245 -0.789272 1.373892
H  -6.669621 0.498222 0.221562
elementType: S P O C H
totalener: -2002.88551496 hartree
nucrepener: 1502.97332125 hartree
electener: -3505.85883621 hartree
oneelecener: -5749.43821903 hartree
twoeener: 2243.57938283 hartree
cpcmener: -0.01704981 hartree
kineticenergy: 1997.84078685 hartree
xcener: -120.676677696599 hartree
chargesum: -0.0000000
charge: -0.167809 -0.166095 -0.452755 0.641026 -0.359452 -0.346515 -0.109332 -0.112140 0.045586 0.034979 -0.119709 -0.246719 -0.236496 -0.252385 0.114911 0.133824 0.106943 0.108285 0.085069 0.108043 0.110207 0.091415 0.095509 0.094130 0.090430 0.077439 0.098284 0.074833 0.090766 0.098073 0.093532 0.088037 0.088086
qa: -0.1678 -0.1661 -0.4528 0.6410 -0.3595 -0.3465 -0.1093 -0.1121 0.0456 0.0350 -0.1197 -0.2467 -0.2365 -0.2524 0.1149 0.1338 0.1069 0.1083 0.0851 0.1080 0.1102 0.0914 0.0955 0.0941 0.0904 0.0774 0.0983 0.0748 0.0908 0.0981 0.0935 0.0880 0.0881
va: 2.3059 2.1952 1.9857 5.4159 2.0840 2.0868 3.8546 3.9449 3.8544 3.8571 4.0108 3.9325 3.9077 3.9157 1.0420 1.0063 1.0213 1.0256 1.0114 0.9938 0.9903 1.0124 0.9997 0.9980 1.0022 1.0183 1.0097 1.0141 1.0065 1.0097 1.0024 1.0069 1.0082
dispcorr: -0.014388836 hartree
energy: -2002.899903791287
dipole: -3.05834 3.25363 0.19529 0.51323 -1.13952 -0.62629 -1.39656 0.37817 -1.01838
magnitude: 1.21140 au
magnitude: 3.07913 debye
