program: Orca
programVersion: 5.0.4
elementType: S S S P O O C C C C C C C C H H H H H H H H H H H H H H H H H H H
charge: 0
multiplicity: 1
keywords: wb97x-d3
keywords: def2-TZVPP
keywords: def2/J RIJCOSX
keywords: DEFGRID2
keywords: scfconv7
keywords: smallprint printgap noloewdin
keywords: NOSOSCF
formula: C8H19O2PS3
InChI: InChI=1/C8H19O2PS3/c1-4-9-11(12,10-5-2)14-8-7-13-6-3/h4-8H2,1-3H3
33 atoms
S  -0.778497 0.650087 -1.064956
S  -2.608876 -1.887452 0.346219
S  1.316097 1.344682 1.539171
P  1.056096 0.39799 -0.123298
O  1.215868 -1.190586 -0.050589
O  2.054745 0.744196 -1.327815
C  -1.899914 0.845596 0.354823
C  -2.095339 -0.388082 1.212914
C  2.138327 -1.828631 0.856188
C  2.335156 2.109539 -1.697949
C  -4.197503 -1.387145 -0.37338
C  3.582958 -1.627943 0.468054
C  3.684552 2.537804 -1.179972
C  -5.265575 -1.034297 0.641592
H  -2.840749 1.174795 -0.088967
H  -1.535093 1.668513 0.971706
H  -2.812862 -0.141395 1.998751
H  -1.166604 -0.64848 1.723931
H  1.951721 -1.471232 1.871098
H  1.870437 -2.88359 0.819342
H  2.305808 2.133833 -2.787219
H  1.548622 2.776841 -1.33574
H  -4.040798 -0.570371 -1.080592
H  -4.508971 -2.248669 -0.967462
H  4.210056 -2.229592 1.127542
H  3.773489 -1.94896 -0.55621
H  3.900036 -0.589777 0.574732
H  3.710699 2.546957 -0.090488
H  4.478295 1.884492 -1.543801
H  3.897929 3.54885 -1.530193
H  -6.202997 -0.802025 0.132276
H  -5.451272 -1.861636 1.326518
H  -4.99577 -0.15955 1.234516
elementType: S P O C H
totalener: -2002.88338184 hartree
nucrepener: 1548.00018889 hartree
electener: -3550.88357074 hartree
oneelecener: -5839.84583463 hartree
twoeener: 2288.96226389 hartree
cpcmener: -0.01853170 hartree
kineticenergy: 1997.85641198 hartree
xcener: -120.683862397633 hartree
chargesum: 0.0000000
charge: -0.156051 -0.168224 -0.461516 0.645363 -0.343307 -0.360574 -0.132602 -0.141274 0.038457 0.046035 -0.105591 -0.239303 -0.247475 -0.256699 0.134557 0.134293 0.125532 0.104847 0.091083 0.108438 0.108165 0.083550 0.088923 0.111787 0.097432 0.091715 0.075217 0.077726 0.090220 0.097910 0.095346 0.081212 0.084812
qa: -0.1561 -0.1682 -0.4615 0.6454 -0.3433 -0.3606 -0.1326 -0.1413 0.0385 0.0460 -0.1056 -0.2393 -0.2475 -0.2567 0.1346 0.1343 0.1255 0.1048 0.0911 0.1084 0.1082 0.0835 0.0889 0.1118 0.0974 0.0917 0.0752 0.0777 0.0902 0.0979 0.0953 0.0812 0.0848
va: 2.3111 2.1808 1.9756 5.4168 2.0910 2.0839 3.8663 3.9537 3.8524 3.8544 3.9586 3.9137 3.9306 3.9260 0.9961 1.0282 1.0032 1.0220 1.0124 0.9906 0.9938 1.0130 1.0080 1.0001 1.0098 1.0061 1.0142 1.0185 1.0025 1.0098 1.0047 1.0134 0.9991
dispcorr: -0.015542212 hartree
energy: -2002.898924053294
dipole: -2.38444 1.92612 -0.45831 -0.16786 0.69866 0.53080 1.40793 -1.68842 -0.28049
magnitude: 0.75530 au
magnitude: 1.91982 debye
