program: Orca
programVersion: 5.0.4
elementType: S S S P O O C C C C C C C C H H H H H H H H H H H H H H H H H H H
charge: 0
multiplicity: 1
keywords: wb97x-d3
keywords: def2-TZVPP
keywords: def2/J RIJCOSX
keywords: DEFGRID2
keywords: scfconv7
keywords: smallprint printgap noloewdin
keywords: NOSOSCF
formula: C8H19O2PS3
InChI: InChI=1/C8H19O2PS3/c1-4-9-11(12,10-5-2)14-8-7-13-6-3/h4-8H2,1-3H3
33 atoms
S  -0.220491 -1.39246 -0.172173
S  -3.048498 0.564569 -0.396432
S  1.682856 0.473647 1.977745
P  1.212582 0.075168 0.147842
O  2.392215 -0.448946 -0.803046
O  0.630281 1.302306 -0.698719
C  -1.376697 -1.06019 1.193587
C  -2.125774 0.256513 1.122699
C  3.540947 -1.164167 -0.309774
C  1.104172 2.652835 -0.524595
C  -4.301043 -0.746346 -0.302563
C  3.235221 -2.600255 0.036129
C  2.515134 2.856376 -1.019963
C  -5.361562 -0.513081 -1.362645
H  -0.826107 -1.121771 2.133731
H  -2.065223 -1.90624 1.171781
H  -1.441708 1.097673 1.242094
H  -2.809398 0.295963 1.975005
H  4.269124 -1.108319 -1.117952
H  3.955498 -0.634461 0.55036
H  0.403563 3.261423 -1.094571
H  1.013743 2.934845 0.526569
H  -3.832697 -1.72076 -0.450276
H  -4.74868 -0.739849 0.693487
H  4.166727 -3.101581 0.303003
H  2.561092 -2.684569 0.888628
H  2.799696 -3.13563 -0.807713
H  3.250109 2.337133 -0.404089
H  2.630722 2.531076 -2.054012
H  2.749811 3.920936 -0.978312
H  -6.10359 -1.311708 -1.329252
H  -5.8817 0.432508 -1.207884
H  -4.934258 -0.504272 -2.366239
elementType: S P O C H
totalener: -2002.88304828 hartree
nucrepener: 1549.07281525 hartree
electener: -3551.95586353 hartree
oneelecener: -5842.09164506 hartree
twoeener: 2290.13578153 hartree
cpcmener: -0.01816053 hartree
kineticenergy: 1997.85820429 hartree
xcener: -120.684072671907 hartree
chargesum: -0.0000000
charge: -0.147660 -0.160334 -0.463757 0.644397 -0.365908 -0.342524 -0.135236 -0.125931 0.042653 0.035828 -0.109993 -0.248754 -0.241650 -0.255493 0.132034 0.136086 0.096866 0.124021 0.108212 0.091869 0.107349 0.090551 0.089265 0.094475 0.100648 0.077589 0.090886 0.077825 0.091082 0.098019 0.093246 0.086330 0.088007
qa: -0.1477 -0.1603 -0.4638 0.6444 -0.3659 -0.3425 -0.1352 -0.1259 0.0427 0.0358 -0.1100 -0.2488 -0.2416 -0.2555 0.1320 0.1361 0.0969 0.1240 0.1082 0.0919 0.1073 0.0906 0.0893 0.0945 0.1006 0.0776 0.0909 0.0778 0.0911 0.0980 0.0932 0.0863 0.0880
va: 2.3053 2.1926 1.9769 5.4072 2.0877 2.0921 3.8651 3.9597 3.8468 3.8554 4.0015 3.9101 3.9123 3.9259 1.0285 0.9954 1.0235 1.0094 0.9905 1.0134 0.9903 1.0124 0.9987 1.0002 1.0107 1.0183 1.0043 1.0156 1.0067 1.0090 1.0023 1.0103 1.0053
dispcorr: -0.015217385 hartree
energy: -2002.898265664443
dipole: -5.34702 5.20271 -0.14431 -1.10781 0.60611 -0.50170 -2.95301 3.10017 0.14716
magnitude: 0.54239 au
magnitude: 1.37864 debye
