program: Orca
programVersion: 5.0.4
elementType: S S S P O O C C C C C C C C H H H H H H H H H H H H H H H H H H H
charge: 0
multiplicity: 1
keywords: wb97x-d3
keywords: def2-TZVPP
keywords: def2/J RIJCOSX
keywords: DEFGRID2
keywords: scfconv7
keywords: smallprint printgap noloewdin
keywords: NOSOSCF
formula: C8H19O2PS3
InChI: InChI=1/C8H19O2PS3/c1-4-9-11(12,10-5-2)14-8-7-13-6-3/h4-8H2,1-3H3
33 atoms
S  0.221389 -1.249272 -1.481504
S  -3.956436 -0.642123 -0.120995
S  0.390897 0.665779 1.357164
P  1.316113 -0.038494 -0.184648
O  2.584278 -0.964269 0.098774
O  1.972283 1.046584 -1.166348
C  -1.370755 -1.479031 -0.607619
C  -2.35981 -0.381092 -0.940798
C  3.599943 -0.575055 1.052653
C  1.201743 2.155208 -1.666667
C  -3.590649 -0.057931 1.561422
C  3.553839 -1.486241 2.251077
C  1.557158 3.424556 -0.93558
C  -3.5048 1.450024 1.679168
H  -1.175932 -1.553657 0.461044
H  -1.735192 -2.448314 -0.948605
H  -2.564783 -0.367448 -2.012349
H  -1.963734 0.599744 -0.674581
H  4.552149 -0.655835 0.529027
H  3.475524 0.467549 1.352829
H  1.441927 2.23127 -2.727026
H  0.130482 1.948006 -1.590939
H  -4.403181 -0.444991 2.179215
H  -2.675737 -0.53375 1.918709
H  3.678714 -2.530871 1.964496
H  4.365492 -1.228674 2.932585
H  2.614015 -1.38253 2.793453
H  1.289757 3.366194 0.119022
H  2.622001 3.645084 -1.014959
H  1.010268 4.259202 -1.376077
H  -3.303669 1.734575 2.71431
H  -2.699771 1.860474 1.069304
H  -4.437571 1.925315 1.375589
elementType: S P O C H
totalener: -2002.88351463 hartree
nucrepener: 1535.37919476 hartree
electener: -3538.26270939 hartree
oneelecener: -5813.99573160 hartree
twoeener: 2275.73302220 hartree
cpcmener: -0.01550113 hartree
kineticenergy: 1997.84995027 hartree
xcener: -120.678083120612 hartree
chargesum: -0.0000000
charge: -0.175153 -0.180027 -0.458790 0.655791 -0.351450 -0.348239 -0.078184 -0.131055 0.041318 0.049915 -0.103065 -0.231946 -0.239486 -0.254086 0.109445 0.128182 0.126715 0.090498 0.105053 0.084129 0.108189 0.077984 0.111643 0.089105 0.089123 0.092116 0.075228 0.076026 0.090313 0.092891 0.095453 0.075514 0.086851
qa: -0.1752 -0.1800 -0.4588 0.6558 -0.3515 -0.3482 -0.0782 -0.1311 0.0413 0.0499 -0.1031 -0.2319 -0.2395 -0.2541 0.1094 0.1282 0.1267 0.0905 0.1051 0.0841 0.1082 0.0780 0.1116 0.0891 0.0891 0.0921 0.0752 0.0760 0.0903 0.0929 0.0955 0.0755 0.0869
va: 2.2897 2.1693 1.9748 5.4079 2.1093 2.0753 3.8067 3.9792 3.8671 3.8760 3.9316 3.9388 3.9389 3.9053 1.0415 1.0209 1.0117 1.0240 0.9962 1.0078 0.9954 0.9999 1.0041 1.0147 1.0042 1.0082 1.0165 1.0202 1.0038 1.0089 1.0037 1.0089 1.0152
dispcorr: -0.015603173 hartree
energy: -2002.899117806704
dipole: -0.54048 1.30545 0.76497 9.76952 -9.14274 0.62678 8.21671 -8.22424 -0.00752
magnitude: 0.98898 au
magnitude: 2.51379 debye
