program: Orca
programVersion: 5.0.4
elementType: S S S P O O C C C C C C C C H H H H H H H H H H H H H H H H H H H
charge: 0
multiplicity: 1
keywords: wb97x-d3
keywords: def2-TZVPP
keywords: def2/J RIJCOSX
keywords: DEFGRID2
keywords: scfconv7
keywords: smallprint printgap noloewdin
keywords: NOSOSCF
formula: C8H19O2PS3
InChI: InChI=1/C8H19O2PS3/c1-4-9-11(12,10-5-2)14-8-7-13-6-3/h4-8H2,1-3H3
33 atoms
S  0.062484 -0.948567 -1.624146
S  -3.544102 -1.731118 0.847911
S  0.123929 1.370978 0.907026
P  1.105697 0.454356 -0.47962
O  2.407991 -0.349909 0.003615
O  1.748759 1.364921 -1.622046
C  -1.639668 -0.830887 -0.960225
C  -1.837413 -1.734556 0.238255
C  2.327271 -1.32499 1.057123
C  2.258091 2.689507 -1.35094
C  -3.638515 -0.116421 1.687936
C  3.723675 -1.627508 1.533538
C  3.484598 2.69534 -0.472356
C  -4.342238 0.957984 0.884459
H  -2.282614 -1.13206 -1.787767
H  -1.851772 0.212228 -0.732137
H  -1.163781 -1.459205 1.050931
H  -1.620264 -2.770032 -0.029088
H  1.719198 -0.934112 1.87711
H  1.839136 -2.223814 0.67223
H  2.485787 3.097585 -2.334503
H  1.461725 3.295065 -0.913608
H  -4.163433 -0.287244 2.62841
H  -2.622733 0.18532 1.946808
H  4.347465 -2.026395 0.733767
H  4.205894 -0.740422 1.944153
H  3.674965 -2.376895 2.32382
H  3.266559 2.375532 0.546451
H  4.276158 2.065452 -0.877143
H  3.867128 3.715638 -0.41756
H  -5.36705 0.671581 0.650119
H  -4.381743 1.888006 1.455272
H  -3.82981 1.164767 -0.054137
elementType: S P O C H
totalener: -2002.88291649 hartree
nucrepener: 1528.61050220 hartree
electener: -3531.49341869 hartree
oneelecener: -5800.42423088 hartree
twoeener: 2268.93081219 hartree
cpcmener: -0.01529875 hartree
kineticenergy: 1997.86033291 hartree
xcener: -120.679253855462 hartree
chargesum: -0.0000000
charge: -0.178687 -0.185083 -0.458855 0.656073 -0.336224 -0.352541 -0.071796 -0.140710 0.046904 0.023550 -0.084504 -0.248118 -0.237011 -0.260300 0.128509 0.103605 0.100290 0.119580 0.091834 0.093916 0.109539 0.094187 0.108376 0.085689 0.089427 0.087795 0.088670 0.076391 0.090775 0.097913 0.087425 0.093031 0.080351
qa: -0.1787 -0.1851 -0.4589 0.6561 -0.3362 -0.3525 -0.0718 -0.1407 0.0469 0.0235 -0.0845 -0.2481 -0.2370 -0.2603 0.1285 0.1036 0.1003 0.1196 0.0918 0.0939 0.1095 0.0942 0.1084 0.0857 0.0894 0.0878 0.0887 0.0764 0.0908 0.0979 0.0874 0.0930 0.0804
va: 2.2912 2.1631 1.9810 5.3862 2.0871 2.1222 3.8049 4.0021 3.8329 3.8736 3.8881 3.9703 3.8862 3.9479 1.0201 1.0489 1.0259 1.0121 1.0037 0.9967 0.9900 1.0086 1.0065 1.0255 1.0037 1.0047 1.0062 1.0207 1.0070 1.0092 1.0072 1.0047 1.0042
dispcorr: -0.015374314 hartree
energy: -2002.898290805722
dipole: 2.72958 -1.86645 0.86312 3.97622 -3.74582 0.23040 8.32333 -8.06672 0.25661
magnitude: 0.92947 au
magnitude: 2.36252 debye
