program: Orca
programVersion: 5.0.4
elementType: S S S P O O C C C C C C C C H H H H H H H H H H H H H H H H H H H
charge: 0
multiplicity: 1
keywords: wb97x-d3
keywords: def2-TZVPP
keywords: def2/J RIJCOSX
keywords: DEFGRID2
keywords: scfconv7
keywords: smallprint printgap noloewdin
keywords: NOSOSCF
formula: C8H19O2PS3
InChI: InChI=1/C8H19O2PS3/c1-4-9-11(12,10-5-2)14-8-7-13-6-3/h4-8H2,1-3H3
33 atoms
S  0.150836 -0.615238 -1.821269
S  -3.866798 -1.065614 0.013616
S  0.351024 1.208714 1.091653
P  1.233137 0.050463 -0.178702
O  1.779736 -1.330752 0.414741
O  2.523076 0.648656 -0.914249
C  -1.324027 -1.341834 -1.007966
C  -2.438511 -0.329788 -0.83016
C  2.266107 -1.450309 1.766929
C  2.743682 2.056465 -1.115325
C  -3.287656 -1.054719 1.73873
C  3.558532 -0.706038 1.996027
C  1.93171 2.608288 -2.261017
C  -3.370876 0.30485 2.402892
H  -1.01677 -1.793209 -0.064563
H  -1.638506 -2.154607 -1.662606
H  -2.795777 0.016813 -1.800868
H  -2.095375 0.545536 -0.278798
H  1.491006 -1.114354 2.459087
H  2.404152 -2.520795 1.913392
H  2.533835 2.595188 -0.189103
H  3.810303 2.143587 -1.317825
H  -3.918065 -1.776629 2.261309
H  -2.271093 -1.450386 1.777498
H  3.923948 -0.936432 2.997615
H  4.328215 -1.005617 1.284064
H  3.427606 0.375132 1.937097
H  2.213865 3.649216 -2.424328
H  2.119457 2.063001 -3.186336
H  0.861248 2.586611 -2.053289
H  -2.773017 1.050512 1.878488
H  -4.399303 0.662602 2.444603
H  -2.993612 0.246023 3.425803
elementType: S P O C H
totalener: -2002.88418407 hartree
nucrepener: 1545.09333716 hartree
electener: -3547.97752123 hartree
oneelecener: -5833.51380814 hartree
twoeener: 2285.53628691 hartree
cpcmener: -0.01597560 hartree
kineticenergy: 1997.84619241 hartree
xcener: -120.679693836998 hartree
chargesum: 0.0000000
charge: -0.168865 -0.180670 -0.462383 0.656884 -0.352371 -0.359339 -0.094036 -0.139686 0.033924 0.046977 -0.094903 -0.238953 -0.248092 -0.258725 0.111889 0.130759 0.124467 0.100570 0.091978 0.108867 0.092005 0.108571 0.108637 0.088054 0.097849 0.091106 0.076697 0.100523 0.092279 0.076589 0.079134 0.085669 0.094592
qa: -0.1689 -0.1807 -0.4624 0.6569 -0.3524 -0.3593 -0.0940 -0.1397 0.0339 0.0470 -0.0949 -0.2390 -0.2481 -0.2587 0.1119 0.1308 0.1245 0.1006 0.0920 0.1089 0.0920 0.1086 0.1086 0.0881 0.0978 0.0911 0.0767 0.1005 0.0923 0.0766 0.0791 0.0857 0.0946
va: 2.2856 2.1626 1.9709 5.4082 2.0981 2.0877 3.8586 3.9467 3.8588 3.8395 3.9252 3.9041 3.9106 3.9211 1.0253 1.0159 1.0129 1.0351 1.0127 0.9914 1.0132 0.9906 1.0044 1.0163 1.0093 1.0066 1.0173 1.0114 1.0032 1.0184 1.0028 1.0145 1.0038
dispcorr: -0.015935930 hartree
energy: -2002.900120001451
dipole: 1.86724 -0.68356 1.18368 4.18836 -4.26612 -0.07776 8.66675 -8.20601 0.46073
magnitude: 1.27257 au
magnitude: 3.23461 debye
