program: Orca
programVersion: 5.0.4
elementType: S S S P O O C C C C C C C C H H H H H H H H H H H H H H H H H H H
charge: 0
multiplicity: 1
keywords: wb97x-d3
keywords: def2-TZVPP
keywords: def2/J RIJCOSX
keywords: DEFGRID2
keywords: scfconv7
keywords: smallprint printgap noloewdin
keywords: NOSOSCF
formula: C8H19O2PS3
InChI: InChI=1/C8H19O2PS3/c1-4-9-11(12,10-5-2)14-8-7-13-6-3/h4-8H2,1-3H3
33 atoms
S  -0.057567 -1.497556 -0.556313
S  -3.44553 -0.72835 -0.572526
S  1.345372 0.07151 2.148818
P  1.176003 -0.015432 0.228173
O  2.531648 -0.235057 -0.598433
O  0.595075 1.296706 -0.482541
C  -1.241675 -1.763265 0.801318
C  -2.359986 -0.745638 0.881896
C  3.673664 -0.929803 -0.064604
C  1.188585 2.590621 -0.241508
C  -2.912322 0.776438 -1.440914
C  3.486102 -2.426082 -0.025789
C  0.238691 3.645699 -0.743552
C  -3.350732 2.058211 -0.762498
H  -0.687095 -1.801418 1.740247
H  -1.638989 -2.762766 0.620472
H  -1.971268 0.257579 1.064479
H  -2.976697 -0.999281 1.747106
H  4.495909 -0.6597 -0.726083
H  3.902593 -0.539607 0.928957
H  1.375514 2.715867 0.827576
H  2.146493 2.645282 -0.762845
H  -1.831914 0.745575 -1.577946
H  -3.358794 0.698655 -2.434082
H  4.421214 -2.887808 0.294227
H  2.712787 -2.725791 0.681617
H  3.235422 -2.827846 -1.007568
H  0.687795 4.628311 -0.594722
H  0.03382 3.531434 -1.808264
H  -0.705141 3.625717 -0.198642
H  -4.436352 2.110694 -0.679523
H  -2.933324 2.15074 0.240995
H  -3.015362 2.92359 -1.337757
elementType: S P O C H
totalener: -2002.88332636 hartree
nucrepener: 1564.28868845 hartree
electener: -3567.17201481 hartree
oneelecener: -5872.04383881 hartree
twoeener: 2304.87182400 hartree
cpcmener: -0.01539739 hartree
kineticenergy: 1997.86023151 hartree
xcener: -120.681289256988 hartree
chargesum: -0.0000000
charge: -0.155663 -0.186620 -0.460834 0.654970 -0.365667 -0.332110 -0.115577 -0.105670 0.037396 0.023945 -0.077363 -0.243945 -0.256627 -0.286881 0.124595 0.124490 0.088425 0.124383 0.107003 0.092578 0.091223 0.108673 0.078497 0.109538 0.100504 0.076561 0.090291 0.100928 0.093152 0.085007 0.093371 0.086813 0.094613
qa: -0.1557 -0.1866 -0.4608 0.6550 -0.3657 -0.3321 -0.1156 -0.1057 0.0374 0.0239 -0.0774 -0.2439 -0.2566 -0.2869 0.1246 0.1245 0.0884 0.1244 0.1070 0.0926 0.0912 0.1087 0.0785 0.1095 0.1005 0.0766 0.0903 0.1009 0.0932 0.0850 0.0934 0.0868 0.0946
va: 2.3011 2.1409 1.9858 5.3918 2.0941 2.1105 3.8960 3.9187 3.8627 3.8609 3.8999 3.9016 3.9421 3.9355 1.0366 1.0120 1.0274 1.0085 0.9909 1.0138 1.0058 0.9940 1.0404 1.0046 1.0112 1.0159 1.0052 1.0084 1.0026 1.0019 1.0173 0.9984 1.0009
dispcorr: -0.016443128 hartree
energy: -2002.899769483699
dipole: -1.53667 2.43708 0.90041 10.44452 -9.73180 0.71272 -3.06540 2.83022 -0.23518
magnitude: 1.17218 au
magnitude: 2.97946 debye
