program: Orca
programVersion: 5.0.4
elementType: S S S P O O C C C C C C C C H H H H H H H H H H H H H H H H H H H
charge: 0
multiplicity: 1
keywords: wb97x-d3
keywords: def2-TZVPP
keywords: def2/J RIJCOSX
keywords: DEFGRID2
keywords: scfconv7
keywords: smallprint printgap noloewdin
keywords: NOSOSCF
formula: C8H19O2PS3
InChI: InChI=1/C8H19O2PS3/c1-4-9-11(12,10-5-2)14-8-7-13-6-3/h4-8H2,1-3H3
33 atoms
S  0.073281 -0.536602 -1.825948
S  -3.976584 -0.825954 0.004453
S  0.376149 1.397067 1.012734
P  1.190481 0.140235 -0.209834
O  1.680351 -1.236415 0.441316
O  2.502439 0.651447 -0.974532
C  -1.414614 -1.198301 -0.977639
C  -2.489113 -0.145154 -0.787991
C  2.185792 -1.305967 1.790732
C  2.771891 2.042903 -1.232666
C  -3.694218 -0.416766 1.752828
C  3.51177 -0.605991 1.961719
C  1.929391 2.599485 -2.353095
C  -2.532374 -1.132485 2.411932
H  -1.115285 -1.66241 -0.039332
H  -1.767889 -1.997864 -1.629307
H  -2.796504 0.252843 -1.755961
H  -2.123075 0.692884 -0.194412
H  1.438407 -0.90134 2.476351
H  2.281423 -2.372115 1.991003
H  2.631317 2.61781 -0.315242
H  3.829994 2.076507 -1.488624
H  -3.585657 0.665558 1.845182
H  -4.631588 -0.680703 2.246853
H  4.257955 -0.976874 1.258859
H  3.426552 0.47495 1.845359
H  3.880561 -0.795782 2.97059
H  2.243715 3.624592 -2.554127
H  2.05109 2.027355 -3.273063
H  0.870252 2.626517 -2.094867
H  -1.574492 -0.811418 2.002011
H  -2.515802 -0.904916 3.480237
H  -2.613144 -2.213809 2.300821
elementType: S P O C H
totalener: -2002.88284571 hartree
nucrepener: 1549.85099378 hartree
electener: -3552.73383949 hartree
oneelecener: -5843.03807619 hartree
twoeener: 2290.30423670 hartree
cpcmener: -0.01549568 hartree
kineticenergy: 1997.84372080 hartree
xcener: -120.679252375399 hartree
chargesum: -0.0000000
charge: -0.168881 -0.183481 -0.459828 0.668304 -0.353840 -0.366090 -0.099543 -0.133359 0.038626 0.044712 -0.103681 -0.242230 -0.250075 -0.228518 0.114246 0.133176 0.123128 0.103294 0.090622 0.109891 0.092325 0.108910 0.092874 0.107045 0.092375 0.076494 0.098199 0.100784 0.092814 0.076203 0.041497 0.099933 0.084072
qa: -0.1689 -0.1835 -0.4598 0.6683 -0.3538 -0.3661 -0.0995 -0.1334 0.0386 0.0447 -0.1037 -0.2422 -0.2501 -0.2285 0.1142 0.1332 0.1231 0.1033 0.0906 0.1099 0.0923 0.1089 0.0929 0.1070 0.0924 0.0765 0.0982 0.1008 0.0928 0.0762 0.0415 0.0999 0.0841
va: 2.2891 2.1679 1.9671 5.3934 2.0913 2.0903 3.8784 3.9161 3.8570 3.8422 3.9672 3.9102 3.9082 3.8859 1.0258 1.0113 1.0136 1.0400 1.0078 0.9912 1.0126 0.9910 1.0104 1.0015 1.0064 1.0172 1.0090 1.0112 1.0032 1.0198 1.0258 1.0077 1.0161
dispcorr: -0.016429118 hartree
energy: -2002.899274824073
dipole: 3.14234 -2.06826 1.07408 1.75143 -1.71793 0.03350 8.77573 -8.26112 0.51460
magnitude: 1.19146 au
magnitude: 3.02845 debye
