program: Orca
programVersion: 5.0.4
elementType: S S S P O O C C C C C C C C H H H H H H H H H H H H H H H H H H H
charge: 0
multiplicity: 1
keywords: wb97x-d3
keywords: def2-TZVPP
keywords: def2/J RIJCOSX
keywords: DEFGRID2
keywords: scfconv7
keywords: smallprint printgap noloewdin
keywords: NOSOSCF
formula: C8H19O2PS3
InChI: InChI=1/C8H19O2PS3/c1-4-9-11(12,10-5-2)14-8-7-13-6-3/h4-8H2,1-3H3
33 atoms
S  -0.640644 0.470105 -1.381557
S  -3.351186 -1.265866 -0.068508
S  1.019844 2.028538 1.179462
P  1.019667 0.614242 -0.132205
O  1.136856 -0.874873 0.445298
O  2.223936 0.631479 -1.189703
C  -1.963961 1.145567 -0.326597
C  -2.536365 0.171524 0.682457
C  2.192067 -1.237389 1.360582
C  2.904752 1.837507 -1.581708
C  -2.126794 -2.585338 0.182499
C  1.830126 -2.553589 1.99706
C  2.104103 2.671522 -2.55063
C  -2.039232 -3.073924 1.613776
H  -2.731159 1.471281 -1.029768
H  -1.582388 2.039059 0.17127
H  -3.290097 0.70378 1.266598
H  -1.777062 -0.160739 1.39197
H  3.131195 -1.313352 0.80884
H  2.305345 -0.459641 2.119361
H  3.1631 2.414701 -0.69134
H  3.833389 1.496543 -2.037733
H  -2.4494 -3.393402 -0.476872
H  -1.15885 -2.247473 -0.186081
H  2.633722 -2.857687 2.66857
H  0.915971 -2.47443 2.58559
H  1.703834 -3.34027 1.25256
H  2.717376 3.510922 -2.881624
H  1.816156 2.099816 -3.433136
H  1.204347 3.082843 -2.092347
H  -1.732421 -2.279661 2.295629
H  -2.998223 -3.460593 1.95889
H  -1.304166 -3.877599 1.694338
elementType: S P O C H
totalener: -2002.88351516 hartree
nucrepener: 1563.04527022 hartree
electener: -3565.92878538 hartree
oneelecener: -5869.54537176 hartree
twoeener: 2303.61658638 hartree
cpcmener: -0.01542486 hartree
kineticenergy: 1997.85641695 hartree
xcener: -120.680702948019 hartree
chargesum: -0.0000000
charge: -0.155229 -0.186550 -0.461426 0.655259 -0.332480 -0.366320 -0.117338 -0.104694 0.024480 0.039570 -0.077146 -0.253996 -0.244180 -0.284996 0.124632 0.125867 0.123963 0.088118 0.108199 0.090912 0.091726 0.106521 0.109060 0.078141 0.100936 0.083858 0.092328 0.100428 0.089923 0.076738 0.085526 0.093688 0.094486
qa: -0.1552 -0.1865 -0.4614 0.6553 -0.3325 -0.3663 -0.1173 -0.1047 0.0245 0.0396 -0.0771 -0.2540 -0.2442 -0.2850 0.1246 0.1259 0.1240 0.0881 0.1082 0.0909 0.0917 0.1065 0.1091 0.0781 0.1009 0.0839 0.0923 0.1004 0.0899 0.0767 0.0855 0.0937 0.0945
va: 2.3015 2.1396 1.9868 5.3941 2.1106 2.0933 3.8964 3.9172 3.8614 3.8619 3.8975 3.9422 3.9019 3.9349 1.0120 1.0367 1.0088 1.0271 0.9939 1.0059 1.0142 0.9909 1.0049 1.0407 1.0084 1.0022 1.0029 1.0112 1.0050 1.0160 0.9987 1.0168 1.0014
dispcorr: -0.016381639 hartree
energy: -2002.899896801063
dipole: 3.42174 -2.29504 1.12669 -9.19817 8.90087 -0.29731 5.33330 -5.20634 0.12696
magnitude: 1.17216 au
magnitude: 2.97938 debye
