program: Orca
programVersion: 5.0.4
elementType: S S S P O O C C C C C C C C H H H H H H H H H H H H H H H H H H H
charge: 0
multiplicity: 1
keywords: wb97x-d3
keywords: def2-TZVPP
keywords: def2/J RIJCOSX
keywords: DEFGRID2
keywords: scfconv7
keywords: smallprint printgap noloewdin
keywords: NOSOSCF
formula: C8H19O2PS3
InChI: InChI=1/C8H19O2PS3/c1-4-9-11(12,10-5-2)14-8-7-13-6-3/h4-8H2,1-3H3
33 atoms
S  0.144127 -1.397719 1.615059
S  -3.490563 -1.064737 -0.937136
S  2.942889 0.346954 1.542187
P  1.195284 0.173742 0.750213
O  1.180639 -0.016283 -0.844394
O  0.168001 1.382901 0.921582
C  -1.583098 -1.148186 1.048147
C  -1.82793 -1.550995 -0.394032
C  2.209706 -0.725172 -1.555926
C  0.558017 2.767674 0.824541
C  -3.230072 0.714135 -1.224879
C  2.184308 -2.216188 -1.318128
C  0.856323 3.203936 -0.588725
C  -2.442634 1.029839 -2.481175
H  -1.860715 -0.114999 1.245321
H  -2.17308 -1.770221 1.722924
H  -1.764012 -2.634266 -0.504492
H  -1.094101 -1.117818 -1.070605
H  2.023859 -0.499516 -2.605097
H  3.18293 -0.30606 -1.291195
H  -0.292691 3.316463 1.225675
H  1.41227 2.946515 1.481027
H  -4.231249 1.144849 -1.28304
H  -2.755508 1.154631 -0.345713
H  2.474261 -2.476996 -0.300288
H  1.2018 -2.643655 -1.519764
H  2.898534 -2.688698 -1.993767
H  0.038748 2.956607 -1.266815
H  0.978788 4.287821 -0.598574
H  1.777485 2.767255 -0.973838
H  -2.947257 0.65314 -3.37079
H  -2.332357 2.11074 -2.591557
H  -1.439691 0.60282 -2.454623
elementType: S P O C H
totalener: -2002.88378024 hartree
nucrepener: 1570.31842042 hartree
electener: -3573.20220066 hartree
oneelecener: -5883.37074076 hartree
twoeener: 2310.16854010 hartree
cpcmener: -0.01766354 hartree
kineticenergy: 1997.83551412 hartree
xcener: -120.678551028212 hartree
chargesum: 0.0000000
charge: -0.165344 -0.180176 -0.451399 0.627004 -0.341656 -0.342146 -0.119153 -0.125769 0.040437 0.017603 -0.093152 -0.248779 -0.237639 -0.271889 0.119083 0.136594 0.128576 0.090361 0.105908 0.099017 0.106581 0.098232 0.110355 0.087785 0.076676 0.091819 0.104581 0.085159 0.102544 0.081741 0.090861 0.095828 0.080359
qa: -0.1653 -0.1802 -0.4514 0.6270 -0.3417 -0.3421 -0.1192 -0.1258 0.0404 0.0176 -0.0932 -0.2488 -0.2376 -0.2719 0.1191 0.1366 0.1286 0.0904 0.1059 0.0990 0.1066 0.0982 0.1104 0.0878 0.0767 0.0918 0.1046 0.0852 0.1025 0.0817 0.0909 0.0958 0.0804
va: 2.2837 2.1685 2.0134 5.4105 2.0507 2.0966 3.8876 3.9574 3.8211 3.8626 3.9302 3.9212 3.9035 3.9191 1.0210 1.0073 1.0088 1.0311 0.9914 1.0162 0.9903 1.0115 1.0023 1.0166 1.0152 1.0012 1.0125 1.0010 1.0100 1.0149 1.0159 1.0020 1.0041
dispcorr: -0.017708669 hartree
energy: -2002.901488910570
dipole: -5.72016 5.06187 -0.65829 7.62555 -6.71850 0.90705 -16.86546 15.42370 -1.44177
magnitude: 1.82614 au
magnitude: 4.64167 debye
