program: Orca
programVersion: 5.0.4
elementType: S S S P O O C C C C C C C C H H H H H H H H H H H H H H H H H H H
charge: 0
multiplicity: 1
keywords: wb97x-d3
keywords: def2-TZVPP
keywords: def2/J RIJCOSX
keywords: DEFGRID2
keywords: scfconv7
keywords: smallprint printgap noloewdin
keywords: NOSOSCF
formula: C8H19O2PS3
InChI: InChI=1/C8H19O2PS3/c1-4-9-11(12,10-5-2)14-8-7-13-6-3/h4-8H2,1-3H3
33 atoms
S  0.226431 -0.664467 -1.653206
S  -3.603556 -1.683053 0.356762
S  -0.28902 1.906258 0.523423
P  0.92635 0.551964 -0.100283
O  1.406797 -0.393032 1.08953
O  2.324464 1.044379 -0.706064
C  -1.55354 -0.772539 -1.245073
C  -1.836871 -1.660598 -0.050081
C  2.333574 -1.488685 0.929866
C  2.399251 2.072975 -1.711443
C  -3.770921 -0.100012 1.236975
C  3.703899 -1.117948 1.437494
C  3.770779 2.693402 -1.65407
C  -3.189505 -0.110119 2.635998
H  -2.018015 -1.175531 -2.145021
H  -1.922606 0.2422 -1.103378
H  -1.270809 -1.351313 0.829556
H  -1.5525 -2.691416 -0.265488
H  1.914965 -2.31064 1.509856
H  2.373461 -1.814448 -0.112179
H  2.209383 1.624962 -2.68919
H  1.627404 2.824053 -1.526908
H  -3.327936 0.695253 0.635009
H  -4.844083 0.09612 1.269951
H  4.346151 -1.998811 1.39439
H  4.168409 -0.338179 0.83536
H  3.668612 -0.783962 2.474669
H  3.955327 3.162264 -0.68735
H  4.554494 1.959451 -1.84301
H  3.844808 3.465536 -2.420258
H  -3.688406 -0.845056 3.267637
H  -2.122305 -0.332925 2.634257
H  -3.312705 0.871419 3.098817
elementType: S P O C H
totalener: -2002.88641155 hartree
nucrepener: 1537.35035609 hartree
electener: -3540.23676764 hartree
oneelecener: -5817.92058171 hartree
twoeener: 2277.68381407 hartree
cpcmener: -0.01662444 hartree
kineticenergy: 1997.84429226 hartree
xcener: -120.678174149943 hartree
chargesum: -0.0000000
charge: -0.192312 -0.178172 -0.441391 0.634794 -0.341967 -0.338670 -0.089098 -0.133478 0.041976 0.033170 -0.099009 -0.242298 -0.243905 -0.258509 0.130594 0.116416 0.097406 0.125956 0.106372 0.092640 0.098023 0.090787 0.089191 0.111659 0.093812 0.082045 0.087670 0.087938 0.089006 0.090836 0.085966 0.077596 0.094953
qa: -0.1923 -0.1782 -0.4414 0.6348 -0.3420 -0.3387 -0.0891 -0.1335 0.0420 0.0332 -0.0990 -0.2423 -0.2439 -0.2585 0.1306 0.1164 0.0974 0.1260 0.1064 0.0926 0.0980 0.0908 0.0892 0.1117 0.0938 0.0820 0.0877 0.0879 0.0890 0.0908 0.0860 0.0776 0.0950
va: 2.2756 2.1689 2.0228 5.4398 2.0908 2.1074 3.8370 3.9563 3.8456 3.8521 3.9253 3.9482 3.9601 3.9158 1.0128 1.0348 1.0232 1.0137 0.9909 1.0064 0.9954 1.0067 1.0171 1.0034 1.0069 1.0129 1.0045 1.0064 1.0028 1.0071 1.0148 1.0093 1.0036
dispcorr: -0.015662764 hartree
energy: -2002.902074314759
dipole: 7.29310 -5.88902 1.40408 0.20227 -0.71507 -0.51279 4.80691 -5.59324 -0.78633
magnitude: 1.68900 au
magnitude: 4.29309 debye
