program: Orca
programVersion: 5.0.4
elementType: S S S P O O C C C C C C C C H H H H H H H H H H H H H H H H H H H
charge: 0
multiplicity: 1
keywords: wb97x-d3
keywords: def2-TZVPP
keywords: def2/J RIJCOSX
keywords: DEFGRID2
keywords: scfconv7
keywords: smallprint printgap noloewdin
keywords: NOSOSCF
formula: C8H19O2PS3
InChI: InChI=1/C8H19O2PS3/c1-4-9-11(12,10-5-2)14-8-7-13-6-3/h4-8H2,1-3H3
33 atoms
S  -0.232837 -1.137206 -0.628709
S  -2.843232 1.079966 -0.490223
S  1.325145 -0.387408 2.304498
P  1.21633 -0.0498 0.412677
O  2.504454 -0.360089 -0.488094
O  0.979031 1.498728 0.124376
C  -1.579534 -1.20332 0.592937
C  -2.239844 0.122149 0.918877
C  3.158877 -1.645079 -0.463726
C  0.83592 2.066612 -1.19434
C  -4.061007 -0.052968 -1.218213
C  4.363732 -1.625745 0.44226
C  2.096821 2.78114 -1.61267
C  -5.244692 -0.35918 -0.323127
H  -1.192203 -1.655925 1.507691
H  -2.295099 -1.908906 0.167682
H  -1.544278 0.778711 1.444011
H  -3.055328 -0.07292 1.618322
H  2.457097 -2.426594 -0.164064
H  3.447367 -1.846142 -1.494329
H  0.556374 1.299683 -1.919342
H  0.001185 2.762912 -1.12515
H  -4.393472 0.450745 -2.127893
H  -3.562657 -0.968581 -1.541406
H  5.062934 -0.839695 0.159702
H  4.080428 -1.483487 1.483246
H  4.885478 -2.579454 0.362339
H  2.934785 2.096543 -1.737883
H  1.923608 3.273645 -2.570059
H  2.378437 3.549167 -0.892042
H  -5.767352 0.552039 -0.032754
H  -5.953935 -1.002182 -0.847785
H  -4.947219 -0.882336 0.586223
elementType: S P O C H
totalener: -2002.88336704 hartree
nucrepener: 1553.69283846 hartree
electener: -3556.57620550 hartree
oneelecener: -5850.96955045 hartree
twoeener: 2294.39334495 hartree
cpcmener: -0.01819091 hartree
kineticenergy: 1997.85773792 hartree
xcener: -120.685261296192 hartree
chargesum: 0.0000000
charge: -0.177821 -0.161243 -0.448578 0.644295 -0.348171 -0.341969 -0.125014 -0.149415 0.037300 0.049144 -0.104354 -0.239052 -0.250012 -0.256649 0.133743 0.134596 0.109754 0.124860 0.084178 0.107855 0.091267 0.099161 0.111292 0.089948 0.088507 0.076763 0.092726 0.083393 0.093325 0.087649 0.081814 0.095125 0.085581
qa: -0.1778 -0.1612 -0.4486 0.6443 -0.3482 -0.3420 -0.1250 -0.1494 0.0373 0.0491 -0.1044 -0.2391 -0.2500 -0.2566 0.1337 0.1346 0.1098 0.1249 0.0842 0.1079 0.0913 0.0992 0.1113 0.0899 0.0885 0.0768 0.0927 0.0834 0.0933 0.0876 0.0818 0.0951 0.0856
va: 2.2802 2.1892 2.0121 5.4335 2.0906 2.0889 3.8586 3.9595 3.8491 3.8414 3.9467 3.9360 3.9667 3.9218 1.0270 0.9945 1.0259 1.0028 1.0125 0.9931 1.0088 0.9921 1.0010 1.0086 1.0040 1.0214 1.0082 1.0143 1.0062 1.0040 1.0134 1.0048 0.9995
dispcorr: -0.015709619 hartree
energy: -2002.899076660027
dipole: -5.67153 4.94803 -0.72350 -0.92732 -0.07042 -0.99774 -7.30457 5.71707 -1.58750
magnitude: 2.00975 au
magnitude: 5.10837 debye
