program: Orca
programVersion: 5.0.4
elementType: S S S P O O C C C C C C C C H H H H H H H H H H H H H H H H H H H
charge: 0
multiplicity: 1
keywords: wb97x-d3
keywords: def2-TZVPP
keywords: def2/J RIJCOSX
keywords: DEFGRID2
keywords: scfconv7
keywords: smallprint printgap noloewdin
keywords: NOSOSCF
formula: C8H19O2PS3
InChI: InChI=1/C8H19O2PS3/c1-4-9-11(12,10-5-2)14-8-7-13-6-3/h4-8H2,1-3H3
33 atoms
S  0.479221 -1.659659 -0.935114
S  -3.784766 -0.510696 -0.434026
S  0.570904 0.369085 1.814897
P  1.249256 0.009275 0.043031
O  2.826734 -0.240075 -0.077633
O  1.022782 1.163879 -1.041557
C  -1.263198 -1.634761 -0.380532
C  -2.095125 -0.582829 -1.087771
C  3.61502 -0.812801 0.982814
C  1.298298 2.547345 -0.740321
C  -3.513089 0.393222 1.12168
C  3.4180 -2.301945 1.124966
C  0.531661 3.404879 -1.713048
C  -3.199018 1.864117 0.936762
H  -1.264213 -1.510474 0.702459
H  -1.636011 -2.636349 -0.598704
H  -2.180916 -0.817372 -2.149671
H  -1.641253 0.405582 -1.020693
H  4.645492 -0.583105 0.715129
H  3.38997 -0.298105 1.919286
H  0.999173 2.768499 0.286595
H  2.373288 2.71808 -0.825139
H  -4.438853 0.268055 1.68638
H  -2.730609 -0.10411 1.697483
H  3.617083 -2.827523 0.190764
H  4.117309 -2.676587 1.873791
H  2.411789 -2.554666 1.459776
H  0.818551 3.202189 -2.745276
H  -0.544347 3.257435 -1.613781
H  0.744599 4.454465 -1.508214
H  -2.284911 2.019175 0.363214
H  -4.010538 2.383371 0.427272
H  -3.052016 2.338712 1.908899
elementType: S P O C H
totalener: -2002.88581815 hartree
nucrepener: 1551.07473198 hartree
electener: -3553.96055013 hartree
oneelecener: -5845.40766135 hartree
twoeener: 2291.44711122 hartree
cpcmener: -0.01524728 hartree
kineticenergy: 1997.84135236 hartree
xcener: -120.678019463953 hartree
chargesum: -0.0000000
charge: -0.164394 -0.179679 -0.460779 0.658459 -0.363571 -0.343692 -0.109332 -0.109364 0.039110 0.016088 -0.104652 -0.247140 -0.240406 -0.239175 0.117709 0.131697 0.127901 0.081116 0.106906 0.093595 0.093840 0.116705 0.111079 0.088526 0.090729 0.100477 0.077982 0.091817 0.085690 0.090959 0.059246 0.086401 0.096153
qa: -0.1644 -0.1797 -0.4608 0.6585 -0.3636 -0.3437 -0.1093 -0.1094 0.0391 0.0161 -0.1047 -0.2471 -0.2404 -0.2392 0.1177 0.1317 0.1279 0.0811 0.1069 0.0936 0.0938 0.1167 0.1111 0.0885 0.0907 0.1005 0.0780 0.0918 0.0857 0.0910 0.0592 0.0864 0.0962
va: 2.2949 2.1698 1.9856 5.4013 2.0999 2.0949 3.8559 3.9515 3.8573 3.8424 3.9382 3.8981 3.9501 3.9152 1.0340 1.0133 1.0124 1.0333 0.9909 1.0138 1.0077 0.9956 1.0028 1.0155 1.0044 1.0112 1.0167 1.0039 1.0019 1.0074 1.0074 1.0164 1.0046
dispcorr: -0.016274993 hartree
energy: -2002.902093142189
dipole: -1.44762 2.46408 1.01645 9.15008 -8.63415 0.51592 2.31846 -2.21943 0.09903
magnitude: 1.14419 au
magnitude: 2.90829 debye
