program: Orca
programVersion: 5.0.4
elementType: S S S P O O C C C C C C C C H H H H H H H H H H H H H H H H H H H
charge: 0
multiplicity: 1
keywords: wb97x-d3
keywords: def2-TZVPP
keywords: def2/J RIJCOSX
keywords: DEFGRID2
keywords: scfconv7
keywords: smallprint printgap noloewdin
keywords: NOSOSCF
formula: C8H19O2PS3
InChI: InChI=1/C8H19O2PS3/c1-4-9-11(12,10-5-2)14-8-7-13-6-3/h4-8H2,1-3H3
33 atoms
S  0.232774 -1.521389 -1.166294
S  -4.00595 -0.902606 -0.014423
S  0.218281 0.951718 1.19725
P  1.13262 0.132609 -0.292366
O  2.601356 -0.436352 -0.004283
O  1.41079 1.086212 -1.543873
C  -1.521408 -0.978478 -1.20399
C  -2.297127 -1.514129 -0.01744
C  2.910182 -1.207745 1.171784
C  1.635641 2.502543 -1.388979
C  -3.774467 0.73596 0.743665
C  4.344923 -0.947831 1.551613
C  2.963357 2.820546 -0.744398
C  -3.579938 0.686282 2.245865
H  -1.92612 -1.360763 -2.140925
H  -1.552147 0.109381 -1.258095
H  -1.812148 -1.25041 0.922216
H  -2.352571 -2.602515 -0.060152
H  2.240611 -0.929227 1.988785
H  2.746228 -2.263429 0.946844
H  1.589728 2.899852 -2.401616
H  0.811593 2.938549 -0.820241
H  -2.939211 1.240897 0.255121
H  -4.672555 1.302722 0.491415
H  5.031766 -1.226408 0.751785
H  4.506006 0.101197 1.801943
H  4.596026 -1.544159 2.429349
H  3.794187 2.365336 -1.284097
H  3.109603 3.90133 -0.757297
H  3.002572 2.498857 0.297057
H  -2.708823 0.092624 2.523529
H  -3.424429 1.69298 2.639239
H  -4.451426 0.26163 2.744303
elementType: S P O C H
totalener: -2002.88497331 hartree
nucrepener: 1531.84493954 hartree
electener: -3534.72991285 hartree
oneelecener: -5807.01693278 hartree
twoeener: 2272.28701994 hartree
cpcmener: -0.01550955 hartree
kineticenergy: 1997.85033564 hartree
xcener: -120.678634591228 hartree
chargesum: -0.0000000
charge: -0.175846 -0.181886 -0.462799 0.663124 -0.352011 -0.349093 -0.090616 -0.131826 0.040218 0.037109 -0.096064 -0.240958 -0.239622 -0.259652 0.130366 0.109866 0.095949 0.127704 0.088593 0.100001 0.109214 0.092122 0.085245 0.110178 0.089757 0.085908 0.089933 0.091628 0.097544 0.074226 0.078884 0.094795 0.088008
qa: -0.1758 -0.1819 -0.4628 0.6631 -0.3520 -0.3491 -0.0906 -0.1318 0.0402 0.0371 -0.0961 -0.2410 -0.2396 -0.2597 0.1304 0.1099 0.0959 0.1277 0.0886 0.1000 0.1092 0.0921 0.0852 0.1102 0.0898 0.0859 0.0899 0.0916 0.0975 0.0742 0.0789 0.0948 0.0880
va: 2.2876 2.1602 1.9757 5.4110 2.0965 2.1030 3.8444 3.9439 3.8464 3.8518 3.9164 3.9544 3.9010 3.9141 1.0177 1.0291 1.0339 1.0115 1.0094 0.9939 0.9913 1.0140 1.0240 1.0054 1.0035 1.0055 1.0076 1.0063 1.0094 1.0189 1.0042 1.0038 1.0141
dispcorr: -0.015368447 hartree
energy: -2002.900341755452
dipole: 4.44791 -3.47134 0.97658 7.60511 -7.12287 0.48225 8.48985 -8.45429 0.03556
magnitude: 1.08974 au
magnitude: 2.76989 debye
