program: Orca
programVersion: 5.0.4
elementType: S S S P O O C C C C C C C C H H H H H H H H H H H H H H H H H H H
charge: 0
multiplicity: 1
keywords: wb97x-d3
keywords: def2-TZVPP
keywords: def2/J RIJCOSX
keywords: DEFGRID2
keywords: scfconv7
keywords: smallprint printgap noloewdin
keywords: NOSOSCF
formula: C8H19O2PS3
InChI: InChI=1/C8H19O2PS3/c1-4-9-11(12,10-5-2)14-8-7-13-6-3/h4-8H2,1-3H3
33 atoms
S  0.293888 -1.756503 -0.982499
S  -3.885999 -0.346736 -0.42401
S  0.61332 0.439277 1.607517
P  1.214984 -0.08646 -0.148633
O  2.756567 -0.499662 -0.294295
O  1.08609 1.016818 -1.297662
C  -1.413164 -1.587851 -0.347858
C  -2.193847 -0.497256 -1.052832
C  3.368415 -1.414347 0.639315
C  1.24052 2.426183 -1.031579
C  -3.5802 0.442457 1.188381
C  4.202611 -0.671599 1.651995
C  2.65832 2.809784 -0.685638
C  -4.851063 1.099886 1.692721
H  -1.356398 -1.428487 0.728856
H  -1.869328 -2.563733 -0.51799
H  -2.276464 -0.716731 -2.118253
H  -1.7018 0.472202 -0.95963
H  2.609355 -2.026197 1.133494
H  3.982972 -2.083182 0.037215
H  0.920783 2.913042 -1.951646
H  0.549112 2.720303 -0.23925
H  -3.224814 -0.298248 1.905701
H  -2.791289 1.186118 1.062611
H  4.961795 -0.055364 1.169419
H  3.588158 -0.035601 2.288676
H  4.714727 -1.392388 2.290923
H  2.972817 2.404878 0.276889
H  3.362518 2.482368 -1.450711
H  2.721037 3.896706 -0.618813
H  -5.6660 0.382569 1.799618
H  -4.6752 1.542718 2.674085
H  -5.183738 1.89223 1.022043
elementType: S P O C H
totalener: -2002.88520430 hartree
nucrepener: 1530.62093836 hartree
electener: -3533.50614266 hartree
oneelecener: -5804.53451011 hartree
twoeener: 2271.02836746 hartree
cpcmener: -0.01531439 hartree
kineticenergy: 1997.84938231 hartree
xcener: -120.678905141531 hartree
chargesum: 0.0000000
charge: -0.169158 -0.174996 -0.454509 0.643940 -0.359504 -0.350169 -0.095253 -0.120242 0.050094 0.037030 -0.099845 -0.249372 -0.238318 -0.255207 0.118009 0.127753 0.122404 0.095663 0.084144 0.107938 0.110985 0.091623 0.091055 0.085298 0.090287 0.078718 0.098285 0.075197 0.091548 0.098547 0.088701 0.093528 0.085825
qa: -0.1692 -0.1750 -0.4545 0.6439 -0.3595 -0.3502 -0.0953 -0.1202 0.0501 0.0370 -0.0998 -0.2494 -0.2383 -0.2552 0.1180 0.1278 0.1224 0.0957 0.0841 0.1079 0.1110 0.0916 0.0911 0.0853 0.0903 0.0787 0.0983 0.0752 0.0915 0.0985 0.0887 0.0935 0.0858
va: 2.3059 2.1891 1.9827 5.4156 2.0814 2.0867 3.8356 3.9711 3.8484 3.8485 3.9791 3.9316 3.9133 3.9409 1.0377 1.0163 1.0123 1.0319 1.0129 0.9942 0.9906 1.0119 1.0016 1.0091 1.0024 1.0178 1.0097 1.0146 1.0063 1.0096 1.0032 1.0025 1.0107
dispcorr: -0.015275785 hartree
energy: -2002.900480081798
dipole: 0.69064 0.19982 0.89047 9.28637 -8.96439 0.32197 7.51573 -7.34175 0.17398
magnitude: 0.96274 au
magnitude: 2.44709 debye
