program: Orca
programVersion: 5.0.4
elementType: S S S P O O C C C C C C C C H H H H H H H H H H H H H H H H H H H
charge: 0
multiplicity: 1
keywords: wb97x-d3
keywords: def2-TZVPP
keywords: def2/J RIJCOSX
keywords: DEFGRID2
keywords: scfconv7
keywords: smallprint printgap noloewdin
keywords: NOSOSCF
formula: C8H19O2PS3
InChI: InChI=1/C8H19O2PS3/c1-4-9-11(12,10-5-2)14-8-7-13-6-3/h4-8H2,1-3H3
33 atoms
S  -0.344164 0.573718 -1.456841
S  -3.461353 -0.619254 1.483707
S  1.271293 1.199747 1.488553
P  1.288289 0.273124 -0.203242
O  1.358219 -1.324662 -0.134164
O  2.504693 0.608462 -1.191679
C  -1.715052 0.632376 -0.245068
C  -1.962217 -0.683091 0.46554
C  2.11885 -2.01805 0.876453
C  3.187376 1.877365 -1.196071
C  -4.748652 -0.904337 0.233214
C  3.610109 -1.87691 0.698073
C  2.380417 2.981109 -1.832095
C  -4.841393 -2.343859 -0.229733
H  -2.574692 0.923254 -0.851339
H  -1.519018 1.437538 0.462149
H  -1.147128 -0.908638 1.154022
H  -2.027242 -1.511583 -0.240919
H  1.808117 -1.669398 1.863759
H  1.814426 -3.059243 0.777231
H  3.469301 2.137742 -0.174137
H  4.101993 1.693967 -1.759056
H  -5.681838 -0.59355 0.706266
H  -4.588366 -0.227342 -0.6083
H  3.95666 -0.860977 0.89044
H  4.109856 -2.532429 1.412663
H  3.92682 -2.172917 -0.30201
H  1.495562 3.235314 -1.248621
H  3.001694 3.876003 -1.893534
H  2.068839 2.723289 -2.844291
H  -5.070991 -3.012452 0.5995
H  -5.631785 -2.448944 -0.975837
H  -3.913476 -2.684438 -0.690779
elementType: S P O C H
totalener: -2002.88483705 hartree
nucrepener: 1522.34451587 hartree
electener: -3525.22935292 hartree
oneelecener: -5788.14843996 hartree
twoeener: 2262.91908703 hartree
cpcmener: -0.01714421 hartree
kineticenergy: 1997.85186811 hartree
xcener: -120.680044323115 hartree
chargesum: 0.0000000
charge: -0.161979 -0.172811 -0.456651 0.646617 -0.350056 -0.365769 -0.110767 -0.126102 0.035449 0.041996 -0.099011 -0.240184 -0.248229 -0.253026 0.131987 0.116224 0.103917 0.112647 0.091758 0.109469 0.092128 0.108322 0.105639 0.093152 0.078179 0.098176 0.090361 0.078413 0.100492 0.091265 0.080365 0.092281 0.085746
qa: -0.1620 -0.1728 -0.4567 0.6466 -0.3501 -0.3658 -0.1108 -0.1261 0.0354 0.0420 -0.0990 -0.2402 -0.2482 -0.2530 0.1320 0.1162 0.1039 0.1126 0.0918 0.1095 0.0921 0.1083 0.1056 0.0932 0.0782 0.0982 0.0904 0.0784 0.1005 0.0913 0.0804 0.0923 0.0857
va: 2.2977 2.1692 1.9832 5.4015 2.0848 2.0887 3.8655 3.9304 3.8545 3.8480 3.9482 3.9115 3.9093 3.9192 1.0076 1.0383 1.0293 1.0167 1.0124 0.9901 1.0132 0.9908 1.0017 1.0078 1.0152 1.0091 1.0067 1.0173 1.0107 1.0041 1.0118 1.0051 1.0023
dispcorr: -0.015089174 hartree
energy: -2002.899926226721
dipole: -2.92717 3.14656 0.21939 -5.60891 5.16462 -0.44430 -3.53162 2.47361 -1.05802
magnitude: 1.16830 au
magnitude: 2.96959 debye
