program: Orca
programVersion: 5.0.4
elementType: S S S P O O C C C C C C C C H H H H H H H H H H H H H H H H H H H
charge: 0
multiplicity: 1
keywords: wb97x-d3
keywords: def2-TZVPP
keywords: def2/J RIJCOSX
keywords: DEFGRID2
keywords: scfconv7
keywords: smallprint printgap noloewdin
keywords: NOSOSCF
formula: C8H19O2PS3
InChI: InChI=1/C8H19O2PS3/c1-4-9-11(12,10-5-2)14-8-7-13-6-3/h4-8H2,1-3H3
33 atoms
S  -0.261646 -0.319994 1.550733
S  -3.479429 -0.541499 -1.505622
S  2.665891 1.143545 1.806046
P  1.380977 0.451451 0.551598
O  1.907995 -0.701341 -0.434359
O  0.763368 1.470351 -0.511124
C  -1.353465 -0.931906 0.205503
C  -2.337443 0.122695 -0.261651
C  2.600773 -1.856907 0.071687
C  1.544007 2.518506 -1.124605
C  -4.735031 -1.322179 -0.445292
C  3.522879 -2.370559 -1.003816
C  2.527456 2.003048 -2.14636
C  -5.702005 -0.33426 0.176224
H  -1.869494 -1.786323 0.645251
H  -0.7452 -1.309623 -0.615239
H  -1.816935 0.956563 -0.730689
H  -2.907527 0.530578 0.57436
H  3.168319 -1.590254 0.966853
H  1.8626 -2.611024 0.353813
H  0.805379 3.167929 -1.59173
H  2.049057 3.092582 -0.344885
H  -5.266565 -2.022392 -1.092167
H  -4.236332 -1.92408 0.316849
H  4.043977 -3.255506 -0.637012
H  2.976787 -2.654118 -1.903938
H  4.273975 -1.626261 -1.270339
H  2.968455 2.855081 -2.66536
H  3.342774 1.440043 -1.691787
H  2.040523 1.37501 -2.892482
H  -6.238969 0.226523 -0.588668
H  -6.439068 -0.859979 0.787127
H  -5.193156 0.380638 0.823992
elementType: S P O C H
totalener: -2002.88655274 hartree
nucrepener: 1500.20888276 hartree
electener: -3503.09543550 hartree
oneelecener: -5743.52433066 hartree
twoeener: 2240.42889516 hartree
cpcmener: -0.01869920 hartree
kineticenergy: 1997.83530384 hartree
xcener: -120.674100885102 hartree
chargesum: 0.0000000
charge: -0.170377 -0.180048 -0.455579 0.632471 -0.337583 -0.339871 -0.116628 -0.132649 0.046304 0.024014 -0.095441 -0.245171 -0.232056 -0.254208 0.132928 0.117345 0.122440 0.109315 0.093011 0.096865 0.103664 0.093713 0.104610 0.094132 0.091020 0.089435 0.086695 0.098533 0.076016 0.089498 0.080420 0.092411 0.084768
qa: -0.1704 -0.1800 -0.4556 0.6325 -0.3376 -0.3399 -0.1166 -0.1326 0.0463 0.0240 -0.0954 -0.2452 -0.2321 -0.2542 0.1329 0.1173 0.1224 0.1093 0.0930 0.0969 0.1037 0.0937 0.1046 0.0941 0.0910 0.0894 0.0867 0.0985 0.0760 0.0895 0.0804 0.0924 0.0848
va: 2.2910 2.1600 2.0060 5.4197 2.0569 2.1066 3.8676 3.9554 3.8271 3.8722 3.9422 3.9566 3.8882 3.9240 1.0081 1.0348 1.0240 1.0125 1.0125 0.9943 0.9902 1.0108 1.0025 1.0085 1.0074 1.0031 1.0055 1.0095 1.0186 1.0067 1.0119 1.0051 1.0027
dispcorr: -0.014456524 hartree
energy: -2002.901009264568
dipole: -7.68956 6.89954 -0.79002 -5.88825 4.87182 -1.01643 -11.11106 10.18386 -0.92720
magnitude: 1.58649 au
magnitude: 4.03255 debye
