program: Orca
programVersion: 5.0.4
elementType: S S S P O O C C C C C C C C H H H H H H H H H H H H H H H H H H H
charge: 0
multiplicity: 1
keywords: wb97x-d3
keywords: def2-TZVPP
keywords: def2/J RIJCOSX
keywords: DEFGRID2
keywords: scfconv7
keywords: smallprint printgap noloewdin
keywords: NOSOSCF
formula: C8H19O2PS3
InChI: InChI=1/C8H19O2PS3/c1-4-9-11(12,10-5-2)14-8-7-13-6-3/h4-8H2,1-3H3
33 atoms
S  -0.416058 0.965033 1.243871
S  -3.337854 -1.313702 -1.216877
S  2.823502 0.773241 1.81176
P  1.429077 0.303666 0.569537
O  1.196069 -1.248747 0.277192
O  1.596499 0.856311 -0.930077
C  -1.567197 0.484119 -0.107529
C  -2.136714 -0.907899 0.080468
C  2.278667 -2.202688 0.225479
C  1.884791 2.243074 -1.184529
C  -4.8249 -0.46457 -0.606296
C  3.140847 -2.051319 -1.003102
C  2.491326 2.358311 -2.558307
C  -5.495358 -1.164326 0.558465
H  -1.062874 0.587895 -1.067344
H  -2.352312 1.240687 -0.070951
H  -2.601406 -1.017191 1.061408
H  -1.351826 -1.660075 0.014082
H  2.873697 -2.119579 1.137241
H  1.784978 -3.1731 0.235845
H  0.9573 2.815856 -1.113456
H  2.574394 2.62278 -0.426464
H  -4.574921 0.568302 -0.356802
H  -5.499203 -0.419452 -1.463468
H  3.850507 -2.879475 -1.034974
H  2.548745 -2.085582 -1.917742
H  3.719011 -1.127161 -0.992448
H  2.704396 3.406925 -2.767953
H  3.429414 1.806684 -2.626248
H  1.814752 1.994548 -3.332175
H  -4.839696 -1.229657 1.427455
H  -6.387267 -0.614179 0.86555
H  -5.800698 -2.175588 0.290096
elementType: S P O C H
totalener: -2002.88679073 hartree
nucrepener: 1502.82513206 hartree
electener: -3505.71192279 hartree
oneelecener: -5748.74747184 hartree
twoeener: 2243.03554905 hartree
cpcmener: -0.01860603 hartree
kineticenergy: 1997.83370311 hartree
xcener: -120.674300624215 hartree
chargesum: 0.0000000
charge: -0.171584 -0.177794 -0.454182 0.630863 -0.339110 -0.337768 -0.116953 -0.135270 0.024654 0.046095 -0.100004 -0.229457 -0.246056 -0.251777 0.116299 0.135141 0.107801 0.123860 0.094111 0.103216 0.097046 0.095904 0.093288 0.105902 0.097220 0.089133 0.075347 0.089512 0.087710 0.089369 0.085029 0.092559 0.079894
qa: -0.1716 -0.1778 -0.4542 0.6309 -0.3391 -0.3378 -0.1170 -0.1353 0.0247 0.0461 -0.1000 -0.2295 -0.2461 -0.2518 0.1163 0.1351 0.1078 0.1239 0.0941 0.1032 0.0970 0.0959 0.0933 0.1059 0.0972 0.0891 0.0753 0.0895 0.0877 0.0894 0.0850 0.0926 0.0799
va: 2.2901 2.1658 2.0051 5.4162 2.1046 2.0561 3.8593 3.9608 3.8709 3.8221 3.9472 3.8870 3.9603 3.9191 1.0362 1.0060 1.0132 1.0226 1.0108 0.9905 0.9947 1.0123 1.0085 1.0017 1.0097 1.0065 1.0202 1.0071 1.0050 1.0028 1.0022 1.0051 1.0123
dispcorr: -0.014517119 hartree
energy: -2002.901307846976
dipole: -8.91671 7.89151 -1.02520 -3.08850 3.19632 0.10782 -11.88069 10.67382 -1.20687
magnitude: 1.58720 au
magnitude: 4.03434 debye
