program: Orca
programVersion: 5.0.4
elementType: S S S P O O C C C C C C C C H H H H H H H H H H H H H H H H H H H
charge: 0
multiplicity: 1
keywords: wb97x-d3
keywords: def2-TZVPP
keywords: def2/J RIJCOSX
keywords: DEFGRID2
keywords: scfconv7
keywords: smallprint printgap noloewdin
keywords: NOSOSCF
formula: C8H19O2PS3
InChI: InChI=1/C8H19O2PS3/c1-4-9-11(12,10-5-2)14-8-7-13-6-3/h4-8H2,1-3H3
33 atoms
S  0.629284 -1.244625 -1.064638
S  -3.632001 -0.059622 -0.562503
S  0.55462 0.268069 1.992272
P  1.390625 0.184642 0.261724
O  2.954762 -0.154256 0.204049
O  1.327942 1.594776 -0.483358
C  -1.142279 -1.242486 -0.607897
C  -1.887167 -0.001838 -1.057169
C  3.615188 -0.984975 1.17794
C  1.894718 1.817673 -1.791324
C  -3.496848 0.450975 1.179525
C  3.26612 -2.447568 1.051748
C  0.902389 2.570081 -2.638855
C  -4.862979 0.387123 1.836244
H  -1.207125 -1.394612 0.469323
H  -1.54687 -2.131232 -1.093779
H  -1.867966 0.082531 -2.144035
H  -1.442076 0.907317 -0.651965
H  4.677522 -0.825376 0.999498
H  3.385255 -0.614486 2.179176
H  2.814175 2.388336 -1.654759
H  2.160389 0.87376 -2.273318
H  -2.796611 -0.202796 1.700958
H  -3.096351 1.465412 1.220944
H  3.46369 -2.826858 0.049057
H  3.884204 -3.01288 1.750529
H  2.223834 -2.646121 1.300976
H  0.005928 1.977814 -2.826044
H  0.607535 3.511862 -2.174819
H  1.357629 2.80129 -3.60264
H  -5.260844 -0.628176 1.836428
H  -4.790669 0.714603 2.874134
H  -5.584356 1.034434 1.336048
elementType: S P O C H
totalener: -2002.88475951 hartree
nucrepener: 1536.22767246 hartree
electener: -3539.11243196 hartree
oneelecener: -5815.70780632 hartree
twoeener: 2276.59537436 hartree
cpcmener: -0.01641659 hartree
kineticenergy: 1997.84198982 hartree
xcener: -120.678771299550 hartree
chargesum: -0.0000000
charge: -0.186901 -0.175052 -0.443890 0.645929 -0.347480 -0.345493 -0.089463 -0.119486 0.029145 0.021149 -0.108582 -0.244184 -0.230533 -0.257174 0.115046 0.129403 0.126425 0.093658 0.106344 0.094452 0.106032 0.091238 0.088201 0.095146 0.090122 0.101436 0.077777 0.078927 0.092486 0.095270 0.087350 0.094060 0.088641
qa: -0.1869 -0.1751 -0.4439 0.6459 -0.3475 -0.3455 -0.0895 -0.1195 0.0291 0.0211 -0.1086 -0.2442 -0.2305 -0.2572 0.1150 0.1294 0.1264 0.0937 0.1063 0.0945 0.1060 0.0912 0.0882 0.0951 0.0901 0.1014 0.0778 0.0789 0.0925 0.0953 0.0874 0.0941 0.0886
va: 2.2738 2.1891 2.0122 5.4119 2.0927 2.0916 3.8454 3.9508 3.8694 3.8848 3.9968 3.8843 3.9256 3.9320 1.0334 1.0143 1.0102 1.0328 0.9903 1.0103 0.9974 0.9992 1.0005 1.0014 1.0045 1.0112 1.0175 1.0077 1.0048 1.0097 1.0077 1.0021 1.0068
dispcorr: -0.015548093 hartree
energy: -2002.900307602401
dipole: -4.52023 5.69394 1.17371 1.04694 -1.34179 -0.29485 -1.18157 0.32243 -0.85914
magnitude: 1.48413 au
magnitude: 3.77236 debye
