program: Orca
programVersion: 5.0.4
elementType: S S S P O O C C C C C C C C H H H H H H H H H H H H H H H H H H H
charge: 0
multiplicity: 1
keywords: wb97x-d3
keywords: def2-TZVPP
keywords: def2/J RIJCOSX
keywords: DEFGRID2
keywords: scfconv7
keywords: smallprint printgap noloewdin
keywords: NOSOSCF
formula: C8H19O2PS3
InChI: InChI=1/C8H19O2PS3/c1-4-9-11(12,10-5-2)14-8-7-13-6-3/h4-8H2,1-3H3
33 atoms
S  -0.588007 0.069573 -1.745101
S  -3.083475 -1.503797 -0.072677
S  0.69024 2.171014 0.613802
P  0.86118 0.487897 -0.3156
O  0.857126 -0.822199 0.599257
O  2.194021 0.258466 -1.174317
C  -2.055145 0.867907 -1.013233
C  -2.583746 0.210172 0.242466
C  1.457285 -0.849244 1.908921
C  2.674651 1.267382 -2.085089
C  -3.444308 -2.046067 1.622673
C  2.964684 -0.779719 1.865615
C  3.849823 2.006954 -1.4957
C  -2.210826 -2.258936 2.478999
H  -2.799577 0.855386 -1.81127
H  -1.811697 1.911292 -0.811579
H  -3.446923 0.787064 0.583671
H  -1.836012 0.246181 1.035743
H  1.043554 -0.038891 2.513132
H  1.12682 -1.79236 2.342134
H  2.959048 0.736992 -2.993423
H  1.873395 1.961884 -2.350562
H  -4.129828 -1.334371 2.087308
H  -3.995058 -2.981825 1.51103
H  3.324199 0.187122 1.512835
H  3.351657 -0.923264 2.875004
H  3.385233 -1.56181 1.233592
H  3.563935 2.561872 -0.60298
H  4.662975 1.327526 -1.239757
H  4.228688 2.72112 -2.227191
H  -1.53715 -2.984821 2.024727
H  -1.65839 -1.332694 2.637635
H  -2.497643 -2.636179 3.462592
elementType: S P O C H
totalener: -2002.88275259 hartree
nucrepener: 1564.83737717 hartree
electener: -3567.72012976 hartree
oneelecener: -5873.50400311 hartree
twoeener: 2305.78387336 hartree
cpcmener: -0.01773177 hartree
kineticenergy: 1997.86442463 hartree
xcener: -120.684167353514 hartree
chargesum: -0.0000000
charge: -0.157431 -0.168984 -0.459948 0.647726 -0.342562 -0.360126 -0.116214 -0.121868 0.029286 0.044534 -0.089828 -0.239170 -0.248287 -0.260301 0.132288 0.128930 0.122235 0.070974 0.096200 0.107426 0.108321 0.084050 0.091785 0.105126 0.076071 0.098451 0.092185 0.078051 0.090625 0.098314 0.083550 0.079477 0.099112
qa: -0.1574 -0.1690 -0.4599 0.6477 -0.3426 -0.3601 -0.1162 -0.1219 0.0293 0.0445 -0.0898 -0.2392 -0.2483 -0.2603 0.1323 0.1289 0.1222 0.0710 0.0962 0.1074 0.1083 0.0841 0.0918 0.1051 0.0761 0.0985 0.0922 0.0781 0.0906 0.0983 0.0836 0.0795 0.0991
va: 2.3065 2.1800 1.9766 5.4101 2.0824 2.0853 3.8713 4.0006 3.8444 3.8542 3.9515 3.9321 3.9299 3.9201 1.0114 1.0303 1.0057 1.0206 1.0082 0.9856 0.9941 1.0129 1.0088 1.0004 1.0139 1.0088 1.0061 1.0185 1.0025 1.0098 1.0115 0.9992 1.0066
dispcorr: -0.016178370 hartree
energy: -2002.898930957942
dipole: 5.20372 -4.99616 0.20756 -3.13103 3.18190 0.05087 11.56940 -10.88118 0.68822
magnitude: 0.72064 au
magnitude: 1.83171 debye
